program: Gaussian 09
title: 000253564
version: EM64L-G09RevD.01
frameworkgroup: C1[X(C12H14N2O3)]
method: RPBEPBE
basis: SDD
operation: Freq
keyword: #p
keyword: freq=noraman
keyword: PBEPBE/SDD
title: #p freq=noraman PBEPBE/SDD
converged: YES YES NO NO
title: Mulliken charges:
elementType: O O O N N C C C C C C C C C C C C H H H H H H H H H H H H H H
charge: -0.285681 -0.269823 -0.224840 -0.155159 0.012471 0.447656 -0.385632 -0.349521 0.350568 -0.317053 -0.389668 -0.365143 0.276076 -0.659674 -0.742721 0.266876 -0.757012 0.225729 0.267223 0.304293 0.256584 0.223997 0.288161 0.239287 0.239497 0.247028 0.246817 0.246384 0.259639 0.251833 0.251808
chargesum: 0.00000
title: Mulliken charges with hydrogens summed into heavy atoms:
elementType: O O O N N C C C C C C C C C C C C
charge: -0.285681 -0.269823 -0.224840 -0.155159 0.012471 0.447656 -0.159903 -0.082298 0.350568 -0.012760 -0.133084 -0.141147 0.276076 0.107271 -0.002493 0.266876 0.006269
polarizability: 3.45198295e+02 5.38063896e+00 1.50539655e+02 3.41797863e-02 1.06570569e-01 7.61755591e+01
1716.lowfreq: -70.8394 -0.0010 -0.0009 0.0001 3.4354 7.5949 15.9228 26.1278 43.4741
frequency: -70.8373 26.0294 43.4737 52.4683 57.3411 84.5533 122.4933 137.8859 140.1707 173.5711 203.2060 219.9270 234.2483 277.8699 326.4696 343.1244 347.1730 388.3861 406.1580 423.1071 427.4961 505.8951 532.8628 535.6838 566.8885 574.2360 593.7632 624.0696 656.2841 726.8971 734.3346 766.0657 842.4726 853.6563 869.9035 882.9236 924.8044 951.4472 978.7390 983.3277 988.7331 998.8828 1006.5714 1035.4734 1045.3912 1112.6542 1114.8714 1133.4269 1149.0162 1170.0933 1190.9673 1197.3846 1254.2353 1292.4180 1311.7410 1367.5577 1381.8891 1383.6394 1387.2103 1412.4307 1420.3012 1445.5549 1453.3942 1453.9061 1458.3021 1479.4106 1489.0049 1493.0518 1556.8917 1584.8390 1613.6728 1619.4202 1651.9399 2976.3172 3009.0682 3011.2433 3038.3425 3058.4369 3095.3476 3100.2747 3123.1563 3125.7034 3138.5367 3144.8911 3154.4700 3174.7590 3212.1538
redmass: 1.0499 7.6918 3.8302 3.7958 5.2800 5.7123 4.1057 1.0877 4.4977 4.4249 5.7249 1.8866 4.0348 1.5542 4.7259 3.9812 3.2455 4.4502 4.2577 3.7629 3.4391 4.9073 2.6605 4.3822 3.3449 3.0009 5.1740 6.8117 5.3861 6.3298 3.7180 5.2721 1.2650 1.5001 4.2720 6.9203 1.5253 2.5776 1.3529 1.8691 1.3514 1.9513 2.5587 1.6653 1.5989 1.3443 1.3170 2.7356 2.3062 3.4969 1.9320 2.1190 2.3953 1.6515 1.8046 4.1305 1.2247 2.2172 1.2415 1.4530 2.9124 1.0801 1.0487 1.0625 1.0455 1.1402 1.0450 2.5811 6.8120 6.3891 6.4081 7.4897 11.0303 1.0350 1.0369 1.0360 1.0865 1.1020 1.0971 1.0969 1.0977 1.0910 1.1019 1.1009 1.0880 1.0973 1.0941
irintensity: 1.2965 2.3232 1.0243 0.6270 1.9450 6.0121 1.8923 0.6761 3.3431 9.4991 0.9686 0.1864 0.4015 0.0075 15.7157 3.5597 5.8470 6.7289 0.0760 0.1613 13.3906 4.3068 23.6455 19.8552 0.2818 3.9466 33.1932 6.2638 12.5955 3.0038 1.4645 3.2969 4.4521 52.6877 6.9581 82.3606 52.9413 2.9729 0.0328 240.5971 0.2230 52.3183 18.2056 8.5415 10.1035 29.2876 0.1793 261.6578 230.6539 532.4089 27.8735 71.1342 42.6351 82.2712 128.8540 152.5575 29.4083 88.7404 63.1469 81.4424 0.2504 34.2355 16.9512 15.5180 18.0967 132.9030 20.9993 16.2300 45.8122 83.6450 122.6309 204.5216 229.1945 26.4811 4.0223 2.8198 41.7787 26.8902 5.7007 9.6853 0.9639 14.6800 20.7287 7.3253 2.8363 4.8403 2.3359
temp: 298.150 k
press: 1.00000 atm
elementType: 8 8 8 7 7 6 6 6 6 6 6 6 6 6 6 6 6 1 1 1 1 1 1 1 1 1 1 1 1 1 1
symmnumber: 1
zpe: 631367.4 jmol-1
zpe.correction: 0.240475 hartree
zpe.thermalcorrener: 0.257021 hartree
zpe.thermalcorrenthalpy: 0.257965 hartree
zpe.thermalcorrgfe: 0.194777 hartree
zpe.sumelectzpe: -799.586455 hartree
zpe.sumelectthermal: -799.569910 hartree
zpe.sumelectthermalent: -799.568965 hartree
zpe.sumelectthermalfe: -799.632153 hartree
dipole: -3.1183 0.2968 0.0058
dipole: 3.1324
quadrupole: -117.9976 -89.8563 -101.3439
quadrupole: -15.9016 0.0215 0.0216
quadrupole: -14.9317 13.2097 1.7220 -15.9016 0.0215 0.0216
hfenergy: -799.8269302 hartree
pointgroup: C01 [X(C12H14N2O3)]
dipole: 1.2291888 -0.0867145 0.0176251 debye
polarizability: 344.828191|8.9659678|145.2073184|-4.6452599|-19.8129566|81.8779999 unknown
InChI: InChI=1S/C12H14N2O3/c1-9(15)14(3)13-8-11-4-6-12(7-5-11)17-10(2)16/h4-8H,1-3H3
charge 0 multiplicity 1
31 atoms
O  3.941082 -0.625782 0.154788
O  -6.047843 -0.373615 0.157362
O  5.106314 1.343133 -0.415807
N  -3.848084 0.34565 -0.058786
N  -2.515384 -0.023957 0.036268
C  -0.153953 0.489868 -0.128669
C  0.841103 1.461222 -0.418743
C  0.265743 -0.820282 0.245825
C  2.601328 -0.146166 0.029269
C  2.218592 1.163176 -0.345822
C  1.629868 -1.135186 0.324174
C  -1.571459 0.862063 -0.222684
C  -4.817428 -0.653578 0.22803
C  -4.289451 1.700748 -0.438574
C  -4.287867 -2.024025 0.609599
C  5.105384 0.14321 -0.073306
C  6.330669 -0.712143 0.16208
H  0.537349 2.474846 -0.708631
H  -0.495134 -1.57352 0.470585
H  2.969883 1.919681 -0.571485
H  1.968616 -2.135504 0.609981
H  -1.782948 1.904129 -0.517433
H  -5.389327 1.690239 -0.429184
H  -3.930608 1.962007 -1.45167
H  -3.920283 2.451774 0.28469
H  -3.657141 -2.442711 -0.192461
H  -3.657119 -1.967172 1.512717
H  -5.150914 -2.680857 0.793306
H  6.058914 -1.735423 0.455374
H  6.950368 -0.249833 0.950155
H  6.93923 -0.736694 -0.75875
