program: Gaussian 09
title: 000253570
version: EM64L-G09RevD.01
frameworkgroup: C1[X(C18H22N4O)]
method: RPBEPBE
basis: SDD
operation: Freq
keyword: #p
keyword: freq=noraman
keyword: PBEPBE/SDD
title: #p freq=noraman PBEPBE/SDD
converged: YES YES NO NO
title: Mulliken charges:
elementType: O N N N N C C C C C C C C C C C C C C C C C C H H H H H H H H H H H H H H H H H H H H H H
charge: -0.247256 -0.151781 -0.151149 -0.420447 0.051092 0.418995 0.412175 0.281404 -0.371009 -0.347698 0.475579 -0.358343 -0.340105 -0.365808 -0.388647 -0.413358 -0.398867 -0.646396 -0.645633 -0.646663 -0.646335 0.162110 -0.403462 0.235919 0.238937 0.234370 0.237398 0.206096 0.268404 0.214603 0.277607 0.235514 0.218478 0.234684 0.238093 0.216625 0.237047 0.234362 0.216790 0.234441 0.215410 0.237100 0.236984 0.195465 0.277276
chargesum: 0.00000
title: Mulliken charges with hydrogens summed into heavy atoms:
elementType: O N N N N C C C C C C C C C C C C C C C C C C
charge: -0.247256 -0.151781 -0.151149 -0.143171 0.051092 0.418995 0.412175 0.281404 -0.135089 -0.108761 0.475579 -0.123973 -0.102707 -0.159713 -0.120244 -0.198755 -0.121261 0.042281 0.046133 0.038931 0.043158 0.162110 -0.207997
polarizability: 6.08998558e+02 -2.02347572e+00 2.20963902e+02 3.44688733e+00 4.46360937e-01 1.13760312e+02
1716.lowfreq: -9.7812 -2.2125 -0.0017 0.0007 0.0016 3.7850 17.3278 21.2861 28.8574
frequency: 17.3189 20.3251 28.8471 44.9992 66.9548 75.0973 78.1577 80.6968 99.5466 111.3891 119.5145 162.8382 172.2154 182.1868 196.5540 199.7635 203.2540 231.2175 256.9813 268.1365 282.8848 301.3078 326.4798 391.8736 398.5634 412.6430 421.0300 427.1649 452.8965 464.6870 488.0912 496.5288 518.8187 529.7819 580.9877 597.7457 608.3644 632.9048 634.3639 677.6217 723.1427 739.3509 743.0641 755.1433 802.1001 803.5681 826.2005 830.5914 833.8041 896.0639 918.1968 934.1120 942.1342 944.2093 949.8500 982.0359 986.0689 994.5593 996.5069 1025.9841 1056.7088 1056.9489 1107.3621 1108.7595 1110.4140 1110.7161 1121.3752 1133.6373 1137.4334 1165.9432 1166.7992 1195.6780 1201.8062 1249.4833 1254.7278 1260.7455 1261.1080 1315.7653 1321.0259 1339.4355 1362.9791 1365.7362 1377.1841 1381.8010 1427.8016 1429.5196 1442.8970 1446.7872 1457.7188 1460.2072 1464.1001 1464.3755 1475.4561 1475.6719 1492.1574 1494.0671 1497.1351 1505.5896 1507.4710 1530.2357 1531.9066 1547.5616 1551.7388 1583.1571 1609.4879 1629.9779 1634.0598 2938.6931 2939.8560 2940.8119 2948.2769 2949.2301 3004.2317 3007.0478 3010.1763 3011.9165 3096.2352 3097.4242 3105.7808 3106.8512 3107.9218 3110.7931 3146.0252 3147.1179 3161.5753 3163.9883 3168.5066 3170.6781 3384.8981
redmass: 4.7467 3.2716 4.5887 4.4871 3.7308 2.3759 3.4544 3.7721 3.4822 1.7066 1.7211 2.9668 3.1830 3.6121 2.2251 1.1933 1.2346 2.4189 3.5792 3.0980 4.7352 5.0683 4.1198 3.8619 4.1707 4.5401 3.0404 3.2298 3.6718 3.7593 3.6459 3.5521 2.8179 2.2309 4.4207 2.6982 1.6612 5.4793 7.0224 4.0968 4.9735 3.4355 5.5140 4.3472 1.3720 1.3551 4.6966 1.5887 1.8865 5.7547 1.4241 1.4287 3.0812 2.9699 1.4626 1.3679 1.3471 3.2676 2.8705 5.1286 1.5030 1.4970 1.2382 1.2439 1.3244 1.3141 2.6985 1.4557 1.7010 1.6890 1.6888 1.1392 1.2057 1.6727 2.4020 2.8995 2.9365 1.5044 1.5231 1.6168 3.2137 3.3648 4.9743 4.1481 1.4238 1.3161 2.2877 2.5175 1.2145 1.2364 1.0469 1.0409 1.0460 1.0463 1.1186 1.0997 1.6655 1.1457 1.1274 2.5537 2.8361 6.6923 6.7225 5.6859 7.1731 6.1206 6.2601 1.0807 1.0413 1.0372 1.0395 1.0393 1.1001 1.0998 1.1019 1.1021 1.0960 1.0961 1.0941 1.0934 1.0898 1.0891 1.0877 1.0877 1.0930 1.0926 1.0958 1.0950 1.0746
irintensity: 2.1815 0.3429 2.0765 0.5595 1.3880 0.4360 3.0939 2.3952 11.3239 1.5354 1.4661 0.5633 0.3547 5.9680 10.5227 1.1322 1.1358 5.8359 5.1094 5.2939 5.4746 7.1862 8.5525 0.1426 0.2147 3.2587 1.8624 0.1781 3.6438 11.9260 0.0968 9.1372 13.6135 10.9914 2.8602 31.4362 60.4004 3.0009 0.8448 30.4492 7.7609 0.7898 17.3595 9.9604 13.3869 18.7528 7.4148 56.4665 45.7099 37.0694 22.7080 1.5564 70.7948 6.0007 14.2258 4.0181 2.3558 0.1059 0.5933 14.2730 36.9393 17.3052 0.1563 0.1048 2.4088 1.1748 258.4827 50.8515 14.6216 15.7723 34.1248 265.5729 304.1921 16.3644 468.6571 28.3054 52.3633 8.2632 19.2159 15.5539 422.3406 3.6999 3.1170 9.4716 10.7852 10.8829 2.2202 19.5911 54.7565 26.0520 2.5311 0.1337 21.5409 22.0666 39.0444 2.9018 453.7266 142.5168 186.8847 54.5337 190.3747 1.6136 7.5974 56.5515 170.5652 876.2365 51.6255 70.7517 125.2510 111.7945 238.8144 66.6756 26.9537 21.2454 62.6733 66.3918 4.4291 4.5288 59.5983 66.8853 8.8021 14.2715 4.6639 2.4290 27.4003 19.8961 18.0940 19.7945 21.4531
temp: 298.150 k
press: 1.00000 atm
elementType: 8 7 7 7 7 6 6 6 6 6 6 6 6 6 6 6 6 6 6 6 6 6 6 1 1 1 1 1 1 1 1 1 1 1 1 1 1 1 1 1 1 1 1 1 1
symmnumber: 1
zpe: 965554.5 jmol-1
zpe.correction: 0.367760 hartree
zpe.thermalcorrener: 0.391135 hartree
zpe.thermalcorrenthalpy: 0.392079 hartree
zpe.thermalcorrgfe: 0.312333 hartree
zpe.sumelectzpe: -991.627066 hartree
zpe.sumelectthermal: -991.603691 hartree
zpe.sumelectthermalent: -991.602747 hartree
zpe.sumelectthermalfe: -991.682492 hartree
dipole: -0.5664 -5.4172 -0.5130
dipole: 5.4708
quadrupole: -33.5968 -131.8017 -143.8541
quadrupole: 8.9576 1.8779 -0.9472
quadrupole: 69.4874 -28.7175 -40.7699 8.9576 1.8779 -0.9472
hfenergy: -991.9948258 hartree
pointgroup: C01 [X(C18H22N4O1)]
dipole: -0.2430423 1.1058116 -1.830535 debye
polarizability: 608.1524153|-14.4917124|134.3992194|-14.577084|-41.5373841|201.1711374 unknown
InChI: InChI=1S/C18H22N4O/c1-21(2)16-9-5-14(6-10-16)13-19-20-18(23)15-7-11-17(12-8-15)22(3)4/h5-13,20H,1-4H3
charge 0 multiplicity 1
45 atoms
O  -1.232086 -0.960104 2.129895
N  -7.111424 0.514324 -0.218833
N  7.287987 -0.111996 -0.116583
N  -0.587696 0.160704 0.169141
N  0.764026 -0.059345 0.366789
C  -5.76114 0.304781 0.067095
C  5.901345 0.040039 -0.204029
C  -2.969618 -0.111537 0.662147
C  -4.761571 0.397027 -0.955387
C  -5.322089 -0.022012 1.392829
C  3.040255 0.345148 -0.377704
C  5.302089 0.819357 -1.245612
C  5.02466 -0.581042 0.749448
C  -3.403599 0.192549 -0.656874
C  -3.963756 -0.226817 1.670035
C  3.906674 0.962177 -1.321435
C  3.635774 -0.430121 0.66055
C  -7.532539 0.843986 -1.586303
C  -8.118713 0.37844 0.841855
C  8.161988 0.536257 -1.101466
C  7.875665 -0.914516 0.964056
C  -1.546802 -0.358329 1.063301
C  1.593451 0.513272 -0.48676
H  -5.046972 0.611675 -1.988844
H  -6.046222 -0.117471 2.206483
H  5.925607 1.313522 -1.995829
H  5.436591 -1.184035 1.563655
H  -2.689095 0.230112 -1.489411
H  -3.634853 -0.489516 2.681209
H  3.477803 1.566399 -2.131965
H  2.977032 -0.908026 1.393344
H  -7.049391 1.773232 -1.950261
H  -8.622403 1.000508 -1.606786
H  -7.291481 0.030898 -2.30173
H  -8.12441 -0.641688 1.276564
H  -9.118833 0.574241 0.424424
H  -7.947391 1.099601 1.666472
H  7.952331 0.18479 -2.132527
H  9.212868 0.300283 -0.871453
H  8.050036 1.639926 -1.089031
H  8.971961 -0.924036 0.858628
H  7.522093 -1.965043 0.935427
H  7.633086 -0.5011 1.964207
H  1.230642 1.147061 -1.325365
H  -0.904176 0.762126 -0.605871
