program: Gaussian 09
title: 000253532
version: EM64L-G09RevD.01
frameworkgroup: C1[X(C10H15N)]
method: RPBEPBE
basis: SDD
operation: Freq
keyword: #pfreq=noraman
keyword: PBEPBE/SDD
title: #p freq=noraman PBEPBE/SDD
converged: YES YES NO NO
title: Mulliken charges:
elementType: N C C C C C C C C C C H H H H H H H H H H H H H H H
charge: -0.444513 -0.002331 -0.411987 -0.701164 0.483943 -0.681477 -0.436558 -0.380023 -0.194827 -0.223946 -0.280376 0.195134 0.188376 0.208445 0.275115 0.242320 0.206404 0.208897 0.213018 0.225792 0.214670 0.211025 0.228016 0.217242 0.215803 0.223002
chargesum: 0.00000
title: Mulliken charges with hydrogens summed into heavy atoms:
elementType: N C C C C C C C C C C
charge: -0.169398 0.192803 -0.015166 -0.043543 0.483943 -0.027998 -0.225533 -0.152007 0.022415 -0.008143 -0.057374
polarizability: 1.59980465e+02 3.45953467e+00 1.01131762e+02 -6.22581743e+00 1.62972617e+01 8.47176804e+01
1716.lowfreq: -8.1611 -0.0006 -0.0005 -0.0005 8.6224 17.2657 49.2572 60.3509 109.1566
frequency: 48.8237 60.1639 109.1462 135.5291 181.5466 208.7737 210.1381 244.7722 337.6798 370.4438 396.5066 410.8413 432.3540 484.6133 516.7719 595.5448 614.2562 691.7921 751.9415 763.4107 814.3582 823.8065 830.4242 868.0847 930.2068 953.1268 971.0770 973.4162 978.3604 1007.9707 1027.3467 1044.0582 1082.9751 1111.0683 1160.2049 1167.2650 1172.8018 1189.6131 1248.4792 1294.6332 1298.4868 1328.2917 1340.3597 1343.8595 1382.7846 1384.0024 1390.8530 1430.7006 1462.1996 1467.5706 1473.5172 1477.0976 1485.3638 1486.7494 1507.3450 1588.0079 1623.9633 2957.2934 2974.8050 2977.5414 2980.9478 3029.5739 3072.3584 3076.4124 3081.2323 3083.4420 3105.4334 3121.4569 3134.4265 3150.7143 3165.5610 3542.3807
redmass: 3.5745 3.1357 2.0115 2.3902 2.2977 1.6340 1.2710 1.8347 2.6610 2.2656 1.4744 2.9190 2.6052 2.7374 2.8075 4.9680 6.3293 1.8391 1.7959 1.4241 1.2965 2.5576 1.8894 1.5151 1.9616 1.3591 1.2979 1.7900 2.3639 1.6844 1.9928 3.0284 1.5798 2.3761 1.9134 1.2657 1.6579 1.1519 1.2631 1.7318 1.2358 1.4944 1.3901 1.4888 1.2944 3.0271 1.2243 2.2015 1.0876 1.1781 1.0475 1.0574 1.5056 1.1804 2.2284 4.9926 6.3485 1.0681 1.0488 1.0656 1.0365 1.0961 1.0999 1.0997 1.1000 1.0997 1.0871 1.0857 1.0927 1.0933 1.1006 1.0762
irintensity: 0.7578 0.7856 0.6316 0.0877 1.1498 0.1950 0.3077 0.7808 1.6998 31.4881 77.9579 0.9516 11.2812 10.6466 6.1923 0.2478 0.2649 41.3358 83.6634 10.8091 0.6696 1.5013 0.0664 9.5165 1.1226 0.1220 1.0274 18.9073 1.7900 15.0980 14.9061 4.0697 9.6897 14.1929 4.8411 3.3511 21.5519 19.6149 2.3379 41.4113 0.9002 28.5885 4.3520 15.4991 12.2855 54.7497 17.0153 19.2742 3.5964 15.5325 9.5695 8.9196 6.7615 37.4123 178.1344 11.3774 208.1197 17.5670 15.7004 63.5893 25.1015 19.4174 18.6887 64.6567 35.9780 63.8456 16.9299 4.3991 31.1586 45.2001 14.1030 18.1418
temp: 298.150 k
press: 1.00000 atm
elementType: 7 6 6 6 6 6 6 6 6 6 6 1 1 1 1 1 1 1 1 1 1 1 1 1 1 1
symmnumber: 1
zpe: 592983.2 jmol-1
zpe.correction: 0.225855 hartree
zpe.thermalcorrener: 0.237424 hartree
zpe.thermalcorrenthalpy: 0.238368 hartree
zpe.thermalcorrgfe: 0.188307 hartree
zpe.sumelectzpe: -443.974587 hartree
zpe.sumelectthermal: -443.963018 hartree
zpe.sumelectthermalent: -443.962074 hartree
zpe.sumelectthermalfe: -444.012135 hartree
dipole: 2.3111 -0.0907 -0.5676
dipole: 2.3815
quadrupole: -64.2037 -66.0557 -68.1895
quadrupole: 0.5023 -0.9831 5.7483
quadrupole: 1.9459 0.0940 -2.0399 0.5023 -0.9831 5.7483
hfenergy: -444.2004422 hartree
pointgroup: C01 [X(C10H15N1)]
dipole: 0.9087227 -0.034069 -0.2256356 debye
dipolederiv: -1.752119 -0.0937766 0.1101487 0.1927375 -0.418116 0.1974669 0.0457736 0.2135305 -0.3018894 0.6784545 0.181861 0.0087729 0.4150989 0.4325713 -0.0871184 0.2684963 -0.046275 0.2530959 0.0591464 -0.0039001 0.0051357 -0.0087615 0.0585434 0.0673076 0.0000619 0.0573839 0.1526211 -0.0937347 0.0565896 -0.0105197 -0.0872711 -0.1190698 0.1125657 -0.0452484 0.1372844 0.0185089 1.7133415 -0.0123613 -0.217352 -0.2922654 0.0109282 -0.0488612 -0.3924599 -0.0895936 0.1106738 0.0184326 0.032898 -0.0300708 0.0362156 -0.0255217 0.0678323 0.0033394 0.0670776 0.0241631 -0.5076542 0.0679167 0.0925333 -0.2649476 -0.0538163 0.1752737 -0.1568305 0.1267929 -0.1299036 -0.3781488 -0.0450689 -0.033023 0.3967399 -0.0789748 0.0503484 0.326281 0.1320886 -0.1998696 0.2253849 -0.0692458 -0.0985805 0.0167897 0.0902502 0.1595732 -0.0325607 0.1659224 0.0017736 0.2924156 0.1336104 0.0456362 -0.0111253 0.0776243 0.1613951 -0.0583802 0.1337112 -0.0247098 -0.1648162 -0.0422851 -0.0410366 -0.021358 -0.2823429 -0.0317352 -0.0260229 -0.0242561 -0.2589243 0.0208507 0.0089682 0.0641997 -0.0695516 0.0023405 -0.0273406 -0.0043956 -0.0375126 -0.1521332 0.0695567 0.0087191 -0.0180943 0.0609708 0.0196977 -0.0579476 0.0403008 -0.0589274 -0.1895699 -0.1028859 -0.1044448 -0.0050693 -0.1354014 -0.0664447 0.0038246 -0.0407815 -0.0050285 0.065553 0.1323808 -0.0304892 0.0364781 -0.1045125 0.1726117 -0.0900377 0.051945 -0.1340347 0.1862699 -0.0743514 0.1281399 -0.0351395 0.1271552 0.0310066 0.0209963 -0.0276654 -0.0014474 0.0770094 0.0666523 -0.0091961 0.0738602 0.0454736 0.0505578 -0.0912707 0.0781581 -0.0166437 -0.121935 -0.060579 -0.1385146 -0.0486881 -0.1846083 -0.0383008 -0.0251114 -0.0648205 -0.0674906 0.0377199 0.1011373 0.0101399 0.0355437 -0.0038606 0.0327405 -0.1063147 -0.0024745 -0.0470736 -0.1387955 -0.004928 -0.1538563 -0.0000508 -0.149729 -0.0143179 0.0019517 -0.0112207 -0.0302834 0.068538 -0.151456 0.1464081 -0.0076501 0.1382974 0.0010938 0.0261711 0.0108463 0.0119356 0.0763559 0.0276282 0.0784345 0.0754056 0.0497992 -0.0043438 -0.1282988 0.0523923 -0.1314647 0.060456 -0.0119054 -0.1042076 -0.0470657 -0.1102484 0.0214296 -0.076342 -0.0633002 -0.0832335 0.1102941 -0.0172356 -0.1016009 -0.0525213 -0.1151043 0.0052791 -0.0918981 -0.0615069 -0.0939258 0.0904476 0.0561243 0.0444784 0.0464319 0.0672933 -0.0191648 -0.1332237 0.0602486 -0.1287856 0.047399 -0.1416916 0.0107837 0.0507158 0.0121739 0.1137389 -0.0492067 0.0498248 -0.0497508 0.1368512 unknown
polarizability: 159.8975258|3.7463224|101.6993869|-6.6196293|15.9724346|84.232994 unknown
InChI: InChI=1S/C10H15N/c1-3-9(2)11-10-7-5-4-6-8-10/h4-9,11H,3H2,1-2H3
charge 0 multiplicity 1
26 atoms
N  0.851488 -0.365169 -0.45855
C  1.922586 0.552647 -0.03365
C  3.276349 -0.20192 -0.03968
C  1.983405 1.828355 -0.915312
C  -0.51187 -0.201246 -0.193782
C  3.366043 -1.327239 1.012042
C  -1.449569 -1.125262 -0.750516
C  -1.011952 0.8493 0.63418
C  -2.826069 -1.005923 -0.482882
C  -2.394805 0.951061 0.898076
C  -3.316776 0.032254 0.346787
H  1.711201 0.854992 1.012935
H  3.448239 -0.614158 -1.057358
H  4.083387 0.536388 0.130871
H  1.109443 -1.081998 -1.138554
H  0.994444 2.316255 -0.971912
H  2.295463 1.572012 -1.945056
H  2.708055 2.55699 -0.505882
H  3.29237 -0.915745 2.035834
H  2.544532 -2.055608 0.889004
H  4.32455 -1.871987 0.934347
H  -1.08536 -1.94001 -1.390404
H  -0.327953 1.583847 1.070733
H  -3.521645 -1.730105 -0.923451
H  -2.753713 1.764755 1.539812
H  -4.387942 0.122313 0.554166
