program: Gaussian 09
title: 000253514
version: EM64L-G09RevD.01
frameworkgroup: C1[X(C4H9N3O2)]
method: RPBEPBE
basis: SDD
operation: Freq
keyword: #pfreq=noraman
keyword: PBEPBE/SDD
title: #p freq=noraman PBEPBE/SDD
converged: NO NO NO NO
title: Mulliken charges:
elementType: O O N N N C C C C H H H H H H H H H
charge: -0.223499 -0.224447 -0.412171 -0.484265 -0.663825 -0.332779 -0.634558 0.358291 0.301546 0.214163 0.214158 0.278703 0.199351 0.245950 0.245939 0.271596 0.298857 0.346991
chargesum: 0.00000
title: Mulliken charges with hydrogens summed into heavy atoms:
elementType: O O N N N C C C C
charge: -0.223499 -0.224447 -0.133469 -0.212668 -0.017976 0.095541 0.056682 0.358291 0.301546
polarizability: 1.00074706e+02 1.95715660e-01 7.74921993e+01 2.09198335e-03 9.59042382e-04 4.16644250e+01
1716.lowfreq: -109.6716 -62.7451 -13.6039 -8.0032 -3.6525 -0.0010 -0.0008 -0.0004 13.1181
frequency: -109.6270 -62.1181 3.7727 73.6789 132.9078 247.3168 260.0942 290.9692 301.2797 394.2126 415.2586 431.6101 513.5845 582.7690 592.4220 691.5697 728.7382 763.3459 798.2153 848.8760 910.7335 995.8644 1040.2861 1094.7425 1129.2874 1141.3733 1206.0898 1285.8874 1296.3067 1338.8285 1406.0235 1445.6052 1464.6587 1474.3343 1486.2843 1523.2583 1609.9432 1668.1505 1714.3179 2956.7779 2997.5366 3000.8457 3099.4921 3131.3863 3514.1760 3525.3187 3532.8418 3687.5322
redmass: 2.3894 3.2707 1.9064 3.7401 4.8141 1.5307 4.4650 1.1360 6.0224 7.2537 1.2704 3.2227 1.1271 3.5512 1.1672 11.6260 10.3167 5.5818 1.1178 3.3341 4.4930 2.6690 1.8679 2.6169 2.6675 1.5018 2.6349 1.0983 2.8017 1.3323 1.2074 2.0418 1.0398 1.0740 1.1717 1.4226 1.1816 4.1728 7.7925 1.0575 1.1054 1.0407 1.0951 1.1012 1.0762 1.0635 1.0585 1.1035
irintensity: 0.6240 1.4135 4.1656 2.2513 4.8064 31.9276 2.8213 5.0277 0.2816 6.9934 12.3881 4.8748 298.1288 12.5079 215.4697 1.0169 55.7735 6.1755 1.8266 0.1147 1.0146 2.8381 73.2947 41.6462 102.7689 6.3161 397.8847 0.1948 70.1914 122.0334 40.6999 668.5562 10.7071 0.7565 3.1931 86.6305 56.7867 16.2323 492.8099 71.9291 41.2325 39.2979 31.7457 24.3171 0.9446 22.3116 16.6472 34.3931
temp: 298.150 k
press: 1.00000 atm
elementType: 8 8 7 7 7 6 6 6 6 1 1 1 1 1 1 1 1 1
symmnumber: 1
zpe: 375319.4 jmol-1
zpe.correction: 0.142952 hartree
zpe.thermalcorrener: 0.152163 hartree
zpe.thermalcorrenthalpy: 0.153107 hartree
zpe.thermalcorrgfe: 0.105929 hartree
zpe.sumelectzpe: -471.836063 hartree
zpe.sumelectthermal: -471.826852 hartree
zpe.sumelectthermalent: -471.825907 hartree
zpe.sumelectthermalfe: -471.873085 hartree
dipole: -0.4052 -8.0465 0.0018
dipole: 8.0567
quadrupole: -39.8284 -52.9554 -55.4054
quadrupole: -8.0370 0.0040 -0.0025
quadrupole: 9.5680 -3.5590 -6.0090 -8.0370 0.0040 -0.0025
hfenergy: -471.9790141 hartree
pointgroup: C01 [X(C4H9N3O2)]
dipole: 0.3095562 -3.1546055 -0.0015498 debye
dipolederiv: -0.7079677 -0.1151466 0.000043 -0.0866759 -0.942571 -0.0006563 0.0001618 -0.0000925 -0.3215018 -0.7011989 0.1487747 -0.0000684 0.2015899 -0.9690012 -0.0001014 -0.0002074 0.0002643 -0.3541672 -1.2569095 0.3234978 0.000188 0.4530805 -0.509672 0.0000165 0.0005644 -0.0000872 -0.5305722 -2.1326828 -0.0210924 -0.0001109 0.0100131 -0.4062924 -0.0000254 -0.0004006 -0.0000861 -0.4175916 -1.0705322 -0.4550495 0.0001926 -0.4967676 -0.5796564 0.0002229 0.000205 0.0001977 -0.8034446 0.8002895 -0.0483402 -0.0000878 0.1085658 0.1332971 -0.0001823 -0.0000492 -0.0001458 0.3719723 0.0275626 -0.0492007 -0.0000353 -0.0489294 -0.0697579 -0.0000066 -0.0000183 0.0000045 0.0415386 2.3556576 -0.0696492 -0.0003404 0.0928021 1.4277039 0.0010636 -0.0004373 0.0005747 0.3242525 2.3581989 0.1587043 0.00039 -0.2590673 1.4931864 -0.0000047 0.000604 -0.0000501 0.3667896 -0.1097523 0.0435857 -0.0508305 0.0322533 -0.0087562 0.1067204 -0.1141704 0.1303103 -0.0886963 -0.1095473 0.0434198 0.050818 0.0320602 -0.0085357 -0.1066771 0.1141364 -0.1302656 -0.0890014 0.0707405 -0.078506 0.0001037 -0.0742547 0.048326 -0.0001832 0.0001669 -0.000185 0.3444515 -0.2368261 -0.0364932 0.000131 0.0110076 0.0828938 -0.0000241 0.0001547 0.0000014 0.1101201 0.1200545 0.0501142 -0.0662538 0.0040658 0.0294765 0.0678997 -0.0622872 0.0678258 -0.0481629 0.1201443 0.0499907 0.0661662 0.0039475 0.0295882 -0.0678352 0.0621515 -0.0678175 -0.0484053 0.0781799 0.012658 -0.0000589 -0.0043768 0.0116688 -0.000011 0.0000037 -0.0000468 0.3285238 0.1883133 0.0336643 -0.0000872 0.0199292 0.07116 -0.0001718 -0.0002506 -0.0003278 0.4098147 0.2062758 0.0090682 -0.0001594 0.0007568 0.1669422 -0.000044 -0.0003273 -0.0000743 0.4040804 unknown
polarizability: 100.0423525|0.8762877|77.5245509|-0.0008394|0.0083318|41.6644268 unknown
InChI: InChI=1S/C4H9N3O2/c1-2-6-4(9)7-3(5)8/h6-7H,2,5H2,1H3
charge 0 multiplicity 1
18 atoms
O  0.470221 1.260547 0.001419
O  -2.415003 1.222412 0.000267
N  1.37812 -0.919443 0.000189
N  -0.93801 -0.650748 0.000898
N  -3.265117 -0.940816 0.00019
C  2.843271 -0.663005 -0.000287
C  3.28196 0.811636 0.000139
C  0.338947 0.015459 0.001286
C  -2.212341 -0.014562 0.000712
H  3.274144 -1.163109 0.891251
H  3.273407 -1.162362 -0.892595
H  1.131596 -1.911627 -0.000424
H  4.388114 0.835105 -0.000371
H  2.913696 1.351525 -0.885449
H  2.914524 1.35078 0.886519
H  -0.936355 -1.67273 0.000892
H  -3.153344 -1.953046 -0.000439
H  -4.205629 -0.552514 -0.000497
