program: Gaussian 09
title: 000250684
version: EM64L-G09RevD.01
frameworkgroup: C1[X(C10H9NO6)]
method: RPBEPBE
basis: SDD
operation: Freq
keyword: #p
keyword: freq=noraman
keyword: PBEPBE/SDD
title: #p freq=noraman PBEPBE/SDD
converged: YES YES NO NO
title: Mulliken charges:
elementType: O O O O O O N C C C C C C C C C C H H H H H H H H H
charge: -0.416311 -0.404596 -0.196831 -0.213175 -0.207264 -0.197123 0.018574 -0.614367 -0.231951 0.518418 -0.507171 -0.400472 0.370439 0.177613 0.184341 -0.192534 -0.372558 0.248751 0.263101 0.298220 0.318148 0.248100 0.239640 0.290210 0.389236 0.389563
chargesum: 0.00000
title: Mulliken charges with hydrogens summed into heavy atoms:
elementType: O O O O O O N C C C C C C C C C C
charge: -0.027075 -0.015033 -0.196831 -0.213175 -0.207264 -0.197123 0.018574 -0.102515 0.066269 0.518418 -0.189023 -0.152372 0.370439 0.177613 0.184341 0.047106 -0.082348
polarizability: 1.76999810e+02 1.11091222e+01 1.39651578e+02 -1.17233860e+01 1.74834420e+01 8.69570888e+01
1716.lowfreq: -11.8198 -3.5244 -2.6740 -0.0005 -0.0002 0.0005 18.0335 22.8617 38.7961
frequency: 17.2226 22.8493 38.7835 48.1418 63.8334 82.4683 132.2503 154.4007 167.6807 198.2630 233.7843 254.8893 347.0005 364.1449 385.3114 422.9504 444.8452 489.2425 501.4192 526.1047 562.8388 595.2506 599.5756 622.4080 656.2743 686.0262 693.3722 694.4060 705.7731 760.6454 806.1872 822.4133 885.7431 914.5482 942.8682 957.5294 981.4479 989.8106 1000.4571 1019.8817 1060.4268 1072.6029 1089.8145 1091.5393 1172.7352 1182.3583 1207.8953 1226.3698 1227.9152 1256.7161 1300.4360 1302.8896 1322.8274 1355.8735 1373.1566 1399.0843 1437.2024 1470.8381 1479.1732 1589.5892 1616.9401 1662.9040 1676.5543 3022.0622 3042.3812 3087.4853 3126.9019 3158.6571 3178.1581 3188.2618 3515.6068 3518.1948
redmass: 7.3279 10.5423 9.1389 11.2728 8.2376 7.1223 7.8284 7.6252 5.4483 6.6939 4.4934 5.3051 3.0016 7.1025 7.1315 3.2948 4.6374 4.1096 3.9662 4.9868 3.7405 4.1780 1.3818 1.6220 6.6098 4.2627 2.9687 3.0863 5.2458 8.5803 2.3768 1.7265 4.9890 2.6295 1.7611 1.4373 2.6312 6.1232 1.3554 3.7731 2.3431 1.9385 1.7818 1.9847 1.1902 1.1709 4.5457 1.4935 2.7691 1.4486 1.3656 1.8715 1.3729 2.1480 10.9820 5.9815 2.6528 1.1674 2.4499 6.5286 6.9821 8.9912 9.3804 1.0602 1.0826 1.1038 1.0896 1.0931 1.0927 1.0962 1.0642 1.0642
irintensity: 0.1313 0.9353 0.2559 0.1210 1.5843 1.1169 0.7902 1.7640 1.1567 3.3295 0.2634 1.7801 3.0158 2.5619 0.5035 0.0916 10.3700 5.8234 9.6445 2.1707 67.8352 17.0858 152.9145 130.7880 18.1487 32.3844 18.6119 3.5645 29.9424 28.8239 16.2024 17.1166 3.0685 0.7574 7.4625 14.8295 84.2281 0.4852 0.2169 115.4737 231.4368 107.7382 37.1457 18.7346 24.7744 7.7169 128.9781 56.0582 75.5882 2.2562 1.8456 76.5024 8.8290 63.8304 114.9315 0.8024 13.9601 21.9723 33.8823 2.1132 4.9673 215.2711 221.8066 9.3428 1.7580 2.4573 7.5695 10.9038 5.2746 4.4267 35.2931 36.5458
temp: 298.150 k
press: 1.00000 atm
elementType: 8 8 8 8 8 8 7 6 6 6 6 6 6 6 6 6 6 1 1 1 1 1 1 1 1 1
symmnumber: 1
zpe: 479742.0 jmol-1
zpe.correction: 0.182724 hartree
zpe.thermalcorrener: 0.198474 hartree
zpe.thermalcorrenthalpy: 0.199418 hartree
zpe.thermalcorrgfe: 0.135969 hartree
zpe.sumelectzpe: -891.252197 hartree
zpe.sumelectthermal: -891.236447 hartree
zpe.sumelectthermalent: -891.235502 hartree
zpe.sumelectthermalfe: -891.298952 hartree
dipole: 4.1546 5.2101 1.6369
dipole: 6.8619
quadrupole: -112.6326 -94.0705 -94.5179
quadrupole: -3.3234 -2.5359 -6.6217
quadrupole: -12.2256 6.3365 5.8891 -3.3234 -2.5359 -6.6217
hfenergy: -891.4349206 hartree
pointgroup: C01 [X(C10H9N1O6)]
dipole: -1.5702965 2.0681988 -0.7382077 debye
dipolederiv: -0.4998068 0.3721361 -0.0307992 0.3308911 -1.1084194 0.0012772 -0.0255926 -0.0305243 -0.3845881 -0.4949057 -0.09883 -0.2187397 -0.1776674 -0.3317907 -0.2909092 -0.3798047 -0.261201 -1.0630097 -0.8516038 -0.2567523 0.1356418 -0.090768 -0.7645216 0.042943 0.2283496 0.1263169 -0.322948 -0.5158746 0.0148199 -0.2293402 0.2034443 -0.6373589 0.1851972 -0.2690651 -0.0805619 -0.6512976 -0.8959672 0.0461241 0.1330179 0.1096397 -0.4316045 0.0847352 0.1292981 0.0902499 -0.30847 -0.5050164 0.0673993 0.0308091 0.0633825 -0.6996638 0.2444863 0.0447509 0.2302271 -0.3523988 1.4084635 -0.3518336 -0.120667 -0.4520293 1.1318747 -0.3963667 -0.1126274 -0.3808354 0.4176714 0.0867364 0.0204672 0.0410521 0.0916828 0.0853396 -0.0036616 0.0924618 0.0163601 0.1048743 -0.4869712 0.11776 0.0823155 0.0131406 -0.1571421 -0.0781579 0.0428125 -0.0466192 0.0551066 0.3804814 0.1217445 -0.1017846 0.0739622 -0.1641278 0.032558 -0.1661014 0.0092642 -0.0863762 -0.0747224 -0.1986559 0.0649921 0.0680449 -0.0040478 -0.0359568 -0.0394597 0.0402681 -0.098526 -0.0081573 -0.0801725 -0.0178053 -0.0938795 0.0441253 -0.0562656 -0.0020624 -0.0627645 -0.0904195 -0.2333965 0.2698979 -0.0570603 0.3281074 -0.2127953 0.0554678 -0.0745841 0.0624849 0.0489142 1.466378 -0.1290768 -0.2762106 -0.1991617 1.4655503 -0.1039413 -0.4517093 -0.1358777 0.2586361 0.5275176 -0.1361691 0.4522974 -0.1995507 0.9568402 0.1650588 0.6438918 0.3199292 1.306673 -0.2319871 0.0802851 -0.0285714 0.1060532 0.0969968 -0.1239225 -0.0252375 -0.1275407 -0.0656822 -0.0402289 0.0269658 -0.0494444 -0.2366681 0.0047722 -0.0118735 0.0976837 -0.0668419 -0.094595 0.024368 0.022158 0.0320509 0.0404299 -0.0467086 -0.0761457 0.0335053 -0.0283214 0.0626007 0.0218662 -0.0077581 -0.0218774 -0.0251468 0.0459048 0.1116832 0.0052592 0.0489665 0.0181251 0.1283731 -0.0127749 0.0141402 0.0133804 0.0399461 0.0507346 0.0451691 0.029923 0.0119755 0.1701223 -0.0016693 0.0335599 -0.0280619 0.0923618 0.0365429 0.0401446 0.0290983 0.1439769 0.0021792 0.1108706 -0.0068348 0.1047494 0.0395332 0.0291202 -0.0027328 0.023064 0.1252851 0.0652088 -0.0275102 0.0311598 -0.0274121 -0.0394924 0.0928248 0.0378251 0.096918 0.1017214 0.046723 -0.0245371 0.043531 0.0021764 0.14164 0.0129974 0.0298444 0.024123 0.1566232 0.1507899 -0.0372115 0.0804066 -0.0980046 0.3157673 0.0229114 0.094207 0.0206649 0.358427 0.3594309 0.0923228 -0.0158393 0.0792655 0.1370208 0.0086628 -0.0162262 0.05323 0.3477007 unknown
polarizability: 177.4286722|-11.1630717|139.5438858|-8.1681365|-18.495891|86.6359181 unknown
InChI: InChI=1S/C10H9NO6/c12-9(13)8(10(14)15)5-6-2-1-3-7(4-6)11(16)17/h1-4,8,12,14H,5H2
charge 0 multiplicity 1
26 atoms
O  -3.94966 1.628344 0.13493
O  -2.304735 -1.590868 -1.88534
O  -4.350541 -0.63657 0.481377
O  -1.208243 -2.141318 0.089058
O  4.805104 -0.670175 -0.021764
O  3.279297 -1.973918 1.059996
N  3.615811 -0.902326 0.425666
C  -1.168433 0.646974 0.908134
C  -2.099423 0.149038 -0.244993
C  0.263493 0.868022 0.440297
C  1.258865 -0.115161 0.648394
C  0.619436 2.074088 -0.220974
C  2.571511 0.133012 0.195255
C  -3.572073 0.279071 0.153507
C  -1.805357 -1.304753 -0.616053
C  1.939796 2.299882 -0.67059
C  2.937135 1.324518 -0.465815
H  -1.585839 1.595191 1.290105
H  -1.19867 -0.098229 1.721545
H  -1.950043 0.77842 -1.140677
H  1.025005 -1.062336 1.142501
H  -0.144021 2.846791 -0.374902
H  2.193436 3.238061 -1.17435
H  3.969291 1.465788 -0.795897
H  -4.900446 1.711915 0.418773
H  -2.158697 -2.552258 -2.099279
