program: Gaussian 09
title: 000250682
version: EM64L-G09RevD.01
frameworkgroup: C1[X(C14H22N2)]
method: RPBEPBE
basis: SDD
operation: Freq
keyword: #pfreq=noraman
keyword: PBEPBE/SDD
title: #p freq=noraman PBEPBE/SDD
converged: YES YES NO NO
title: Mulliken charges:
elementType: N N C C C C C C C C C C C C C C H H H H H H H H H H H H H H H H H H H H H H
charge: -0.130877 -0.063914 -0.176892 -0.459184 -0.364139 -0.363022 0.439597 -0.304647 -0.290418 -0.713077 -0.455197 -0.384159 -0.706165 -0.226184 -0.241529 -0.246343 0.207065 0.203451 0.229820 0.203888 0.180692 0.201284 0.180844 0.177981 0.235201 0.173230 0.207571 0.214562 0.213572 0.226982 0.236111 0.265925 0.228126 0.215102 0.212944 0.222799 0.223092 0.225908
chargesum: 0.00000
title: Mulliken charges with hydrogens summed into heavy atoms:
elementType: N N C C C C C C C C C C C C C C
charge: -0.130877 -0.063914 0.030173 -0.025913 0.020440 0.019106 0.439597 0.108535 0.090383 -0.057961 -0.219086 -0.118234 -0.049992 -0.003385 -0.018437 -0.020435
polarizability: 2.01051999e+02 1.31175217e+01 1.47471123e+02 -3.62332462e+00 8.08488415e+00 1.38552571e+02
1716.lowfreq: -17.1505 -8.6008 -0.0002 0.0001 0.0003 4.4201 41.7312 51.8669 59.8883
frequency: 41.6113 51.7230 59.8431 66.8571 82.7828 120.4221 146.1416 185.3547 221.4980 230.9926 234.3677 254.3672 269.5389 300.4278 332.1906 350.7978 389.9723 406.5341 453.4959 464.2017 500.5057 552.1972 573.5950 615.8595 627.8351 708.5762 745.5987 763.4438 780.4574 799.5883 806.2802 826.1971 860.3213 907.7689 925.1236 930.0742 961.9339 982.3127 988.0952 990.3978 998.4274 1022.8570 1035.6621 1057.4851 1066.5167 1069.7191 1078.1783 1101.3956 1105.8372 1118.5448 1139.3055 1150.3133 1166.7152 1170.0109 1179.4320 1200.7936 1206.0228 1222.6719 1249.0325 1270.9119 1280.0438 1291.6387 1303.9879 1316.7893 1330.8819 1344.0368 1358.6593 1368.5126 1376.4937 1386.0664 1388.5705 1389.1102 1393.7112 1439.8990 1449.9773 1457.5102 1462.8840 1469.7778 1470.8187 1474.3742 1475.8864 1479.6395 1490.9387 1491.1722 1592.3459 1612.4647 2835.5635 2837.5688 2843.0208 2851.2584 2855.6164 2868.3021 2985.4634 2986.3975 3011.5660 3033.4232 3042.0091 3045.1643 3051.0932 3079.7396 3080.1181 3088.3348 3090.4845 3113.5859 3122.2053 3134.8420 3145.6525 3160.7844
redmass: 3.5692 3.0032 2.9191 2.6876 2.4052 1.9236 2.9173 1.7162 1.8817 2.1149 2.0946 1.9491 2.3774 2.7246 3.0776 2.5411 2.2572 2.8493 3.3290 3.0406 3.2110 2.8693 2.3846 6.3341 4.6817 1.7957 2.4494 2.5178 2.1773 1.1705 1.2374 2.4314 1.2470 2.1608 1.5351 1.8175 2.0215 1.4105 2.5950 5.3348 1.3787 2.2165 1.9988 2.0473 2.5763 1.9687 1.7125 2.1368 2.0590 3.0950 1.8574 2.7569 1.8480 1.0670 1.1155 2.0251 2.6063 1.3291 1.4930 1.3065 1.2565 1.2060 1.4207 1.2655 1.2534 1.4332 1.3372 1.4302 2.0201 1.3853 1.2798 2.1493 1.3781 2.1155 1.0820 1.0926 1.0970 1.0504 1.0524 1.0691 1.0767 2.2630 1.0666 1.0699 6.1400 6.1773 1.0713 1.0746 1.0726 1.0741 1.0709 1.0709 1.0357 1.0356 1.0876 1.0887 1.0880 1.0891 1.0866 1.0984 1.0978 1.1002 1.1004 1.0864 1.0863 1.0914 1.0957 1.1014
irintensity: 0.1860 0.2191 0.0964 0.2588 0.2874 1.4389 0.2078 0.1784 0.9378 0.5366 2.6059 0.2359 0.5965 1.7169 2.7364 3.6016 2.8163 0.0990 7.2809 0.0558 0.4703 5.9282 5.8369 0.1235 4.9848 48.0306 22.0201 23.5411 25.2910 3.1101 3.1534 0.8771 0.0760 3.7382 4.6617 0.4114 12.2866 0.0793 3.1126 0.6467 2.1497 10.7997 18.8966 2.7018 2.1441 8.0624 8.6772 23.7654 12.4696 43.9083 9.2524 104.3325 9.2158 0.1945 1.5695 0.7324 3.4415 6.8725 12.0125 2.7768 14.7369 13.4233 24.5878 7.9809 18.5944 8.3032 6.8020 4.0561 2.9984 8.5299 22.6230 10.7603 8.1589 10.8497 1.7196 9.4866 8.1314 6.0493 10.7435 0.7073 6.1026 18.5789 14.4419 6.6389 1.1941 5.9510 45.8962 73.6072 74.9829 3.5929 3.1305 330.8994 31.4861 31.5157 18.2521 31.0732 8.5492 36.9987 45.1300 61.6274 44.6196 41.6620 36.8481 6.9291 0.1453 19.4889 33.9061 27.7880
temp: 298.150 k
press: 1.00000 atm
elementType: 7 7 6 6 6 6 6 6 6 6 6 6 6 6 6 6 1 1 1 1 1 1 1 1 1 1 1 1 1 1 1 1 1 1 1 1 1 1
symmnumber: 1
zpe: 874933.7 jmol-1
zpe.correction: 0.333245 hartree
zpe.thermalcorrener: 0.349371 hartree
zpe.thermalcorrenthalpy: 0.350315 hartree
zpe.thermalcorrgfe: 0.289269 hartree
zpe.sumelectzpe: -654.925295 hartree
zpe.sumelectthermal: -654.909168 hartree
zpe.sumelectthermalent: -654.908224 hartree
zpe.sumelectthermalfe: -654.969270 hartree
dipole: 0.4061 0.0325 0.0533
dipole: 0.4108
quadrupole: -92.8258 -96.5154 -96.6052
quadrupole: 1.8273 1.6319 0.6729
quadrupole: 2.4897 -1.2000 -1.2897 1.8273 1.6319 0.6729
hfenergy: -655.2585392 hartree
pointgroup: C01 [X(C14H22N2)]
dipole: -0.1600515 0.0033078 -0.0223434 debye
polarizability: 202.5418269|-9.4881687|146.4996577|-2.7948532|-8.1585126|138.034209 unknown
InChI: InChI=1S/C14H22N2/c1-3-15-10-11-16(4-2)14(12-15)13-8-6-5-7-9-13/h5-9,14H,3-4,10-12H2,1-2H3
charge 0 multiplicity 1
38 atoms
N  -0.494247 1.383984 0.02223
N  -2.441438 -0.799623 0.081744
C  -0.11171 0.026058 0.51922
C  -1.003609 -1.04624 -0.162071
C  -1.949728 1.61763 0.219227
C  -2.801075 0.533207 -0.455016
C  1.350202 -0.306879 0.228715
C  0.319131 2.463016 0.651733
C  -3.284765 -1.904399 -0.441981
C  0.173186 3.822729 -0.056651
C  2.145663 -0.959248 1.201878
C  1.91201 -0.037296 -1.045972
C  -4.752294 -1.820432 0.016021
C  3.476978 -1.337438 0.911535
C  3.242433 -0.408762 -1.337674
C  4.029963 -1.063529 -0.360437
H  -0.288732 -0.051611 1.62315
H  -0.762431 -1.049726 -1.256446
H  -0.732285 -2.037415 0.245651
H  -2.212799 2.598327 -0.214549
H  -2.206665 1.641505 1.309343
H  -3.86602 0.739077 -0.247808
H  -2.6475 0.580823 -1.564374
H  0.063399 2.574126 1.737657
H  1.377421 2.152832 0.603137
H  -3.24449 -1.953014 -1.562152
H  -2.847562 -2.850202 -0.067456
H  -0.836303 4.256565 0.057044
H  0.892902 4.547402 0.366463
H  0.382764 3.713255 -1.135583
H  1.721512 -1.167833 2.192389
H  1.298282 0.486788 -1.787478
H  -4.804102 -1.73872 1.116067
H  -5.278827 -0.95311 -0.420763
H  -5.299436 -2.729195 -0.295041
H  4.081598 -1.839147 1.675842
H  3.666841 -0.189978 -2.324453
H  5.062635 -1.352925 -0.586342
