program: Gaussian 09
title: 000250681
version: EM64L-G09RevD.01
frameworkgroup: C1[X(C10H12N2O)]
method: RPBEPBE
basis: SDD
operation: Freq
keyword: #p
keyword: freq=noraman
keyword: PBEPBE/SDD
title: #p freq=noraman PBEPBE/SDD
converged: YES YES NO NO
title: Mulliken charges:
elementType: O N N C C C C C C C C C C H H H H H H H H H H H H
charge: -0.261065 -0.388642 -0.348468 -0.275716 -0.395951 -0.332925 0.434731 0.179334 -0.398948 -0.386886 -0.227665 -0.230567 -0.240885 0.230225 0.199812 0.219624 0.279737 0.232881 0.208943 0.322575 0.269321 0.240913 0.221187 0.223342 0.225094
chargesum: 0.00000
title: Mulliken charges with hydrogens summed into heavy atoms:
elementType: O N N C C C C C C C C C C
charge: -0.261065 -0.108905 -0.025893 -0.045491 0.023484 0.108899 0.434731 0.179334 -0.129627 -0.145973 -0.006477 -0.007225 -0.015791
polarizability: 1.59521565e+02 9.53079823e+00 1.09224195e+02 -1.74640602e+00 1.42530081e+01 8.49832477e+01
1716.lowfreq: -10.6576 -3.7320 -0.0007 -0.0006 -0.0003 9.6966 35.5273 51.4664 91.6355
frequency: 35.4083 51.4548 91.6312 150.2516 211.0392 241.1932 304.8295 328.3128 403.3578 414.1670 461.4115 476.8323 502.3860 529.5881 603.5787 616.4794 639.6632 679.5345 695.9746 706.2410 751.7418 835.5350 840.1916 856.4978 898.8551 933.3951 980.7468 982.0403 990.9975 994.0219 1000.6764 1026.1470 1076.1536 1084.3265 1113.6022 1169.3418 1170.3637 1181.2947 1204.0263 1214.7584 1229.3657 1267.1023 1286.2109 1319.0311 1326.7683 1364.3099 1372.1894 1387.9190 1421.4296 1439.7497 1448.6829 1470.9848 1477.4444 1481.1052 1595.3490 1611.4525 1626.1112 2852.1477 2875.5171 2978.4340 3040.5571 3059.0299 3120.7113 3130.6146 3143.0770 3153.4673 3163.9861 3480.0272 3518.2282
redmass: 4.3754 3.9973 5.4428 3.6797 3.1081 5.0553 4.0339 2.4807 2.8562 3.4030 3.7471 3.8521 3.1910 3.6036 1.9795 5.7828 2.2145 2.5205 2.1840 1.7652 1.8342 3.5783 3.3601 1.2535 2.2625 1.5558 1.8038 1.8654 4.9458 1.8074 1.6689 2.0932 1.6191 1.9220 1.7626 1.1807 2.5676 1.1128 2.2190 1.3690 1.2149 1.5887 1.4083 1.8147 1.3284 1.5085 1.5157 5.6835 1.9712 2.1709 1.3544 1.0929 1.2467 1.9840 6.2683 6.0716 5.9253 1.0801 1.0713 1.0597 1.1032 1.0905 1.0845 1.0880 1.0928 1.0956 1.1011 1.0759 1.0762
irintensity: 1.6474 2.0661 4.2091 0.3662 1.0146 2.5430 0.2762 1.7442 9.9389 22.2516 16.1394 3.5100 6.6200 20.6739 28.2814 0.6538 72.9460 11.2566 91.6148 48.6087 56.5914 6.9448 0.8422 0.7472 2.5159 6.4916 7.1203 2.6245 2.3566 12.8791 7.3174 13.2599 10.4281 2.8419 17.7543 0.2923 11.0858 1.8233 2.3259 32.1604 9.3411 2.1607 72.6478 129.9697 4.7279 1.1797 38.3706 0.3527 17.2968 14.6540 2.2006 6.3229 21.6722 11.4571 0.3831 25.1601 232.5788 39.1077 128.9490 65.1001 48.8259 38.1348 0.8096 6.8997 26.9535 27.0248 19.8447 0.1766 17.7994
temp: 298.150 k
press: 1.00000 atm
elementType: 8 7 7 6 6 6 6 6 6 6 6 6 6 1 1 1 1 1 1 1 1 1 1 1 1
symmnumber: 1
zpe: 538852.2 jmol-1
zpe.correction: 0.205238 hartree
zpe.thermalcorrener: 0.216238 hartree
zpe.thermalcorrenthalpy: 0.217182 hartree
zpe.thermalcorrgfe: 0.167459 hartree
zpe.sumelectzpe: -572.036263 hartree
zpe.sumelectthermal: -572.025263 hartree
zpe.sumelectthermalent: -572.024319 hartree
zpe.sumelectthermalfe: -572.074042 hartree
dipole: -3.0363 -3.2605 1.0220
dipole: 4.5710
quadrupole: -59.3256 -81.7001 -73.6855
quadrupole: 2.6958 1.1215 2.1765
quadrupole: 12.2448 -10.1297 -2.1151 2.6958 1.1215 2.1765
hfenergy: -572.2415008 hartree
pointgroup: C01 [X(C10H12N2O1)]
dipole: -1.1720742 1.3452174 -0.225342 debye
dipolederiv: -0.7307764 0.1324522 0.0714653 0.305125 -1.0332835 -0.004179 0.1234499 0.0786568 -0.3932272 -0.7627675 0.0422605 -0.0781443 0.0729286 -0.4069988 -0.1208978 -0.1261879 -0.1277837 -0.4369623 -1.0511943 0.3924964 0.1089814 0.0286296 -0.4043579 -0.0772341 0.2406974 -0.1585644 -0.481103 0.1517082 -0.2436155 0.0827671 -0.4247837 0.2634492 0.1396466 0.2036855 0.1453608 0.3223978 0.5950816 0.014591 0.1345302 0.137902 0.1630153 0.0836084 0.0280754 0.0774912 0.3103976 0.3629759 -0.1103461 0.0361723 -0.2676309 0.4322885 0.1327645 0.0992346 0.0910182 0.2001176 0.3376742 0.1042103 0.0082761 0.0612421 -0.0931214 0.031327 0.0019066 0.0142048 -0.0663085 1.2948236 -0.4225471 -0.3768553 -0.1103257 1.0468485 -0.0723918 -0.6263738 -0.0639122 0.3709145 -0.1452513 -0.0836295 -0.0403032 -0.0574446 -0.0921163 0.0517012 -0.0271076 0.0595334 -0.089461 -0.1179841 0.0483148 0.0500086 0.0729827 0.0066125 0.1278755 0.0023717 0.0772382 -0.0521757 -0.0242463 0.0331681 0.0592612 0.0275525 -0.0297533 0.1385667 0.0544201 0.1349841 -0.0021201 0.0092463 -0.0984716 -0.0496108 -0.1096185 -0.0286836 0.1001828 -0.0462032 0.0824706 -0.0626384 0.0554282 -0.0141541 0.0524004 0.0032349 -0.1092421 0.0511861 0.0655189 0.058956 -0.1000499 -0.0134586 0.0210206 -0.004537 0.0502772 -0.0594339 -0.0756163 0.0007204 -0.0943436 -0.1517547 -0.1348194 -0.0068552 -0.0594933 -0.1384542 0.0269432 -0.1255315 -0.1615727 -0.0460655 -0.1906787 -0.007875 0.0649803 -0.003921 0.1248454 -0.1302043 0.0113483 0.0060412 -0.0208637 0.0901839 0.1422703 -0.0129496 0.0757217 0.0011077 0.0946947 0.0792941 0.1464591 0.1451878 0.1752795 0.0609642 -0.006018 -0.0594648 0.1073376 -0.0723354 -0.0970796 0.0140427 -0.099374 -0.1111915 -0.2278999 0.0049913 0.014408 -0.0373294 0.0252254 -0.0032843 -0.029041 -0.0022303 0.0898773 0.1600141 0.0395492 0.0603848 0.0522575 0.0965535 0.059606 0.0977337 0.0570803 0.2700512 0.0830433 0.079197 0.0599512 0.0705977 0.0658596 -0.0658401 0.0789075 -0.0612199 0.0931667 0.0827831 -0.0412471 -0.0735611 -0.0353964 0.04666 -0.1005027 -0.0580319 -0.0868116 0.02872 0.0469238 -0.0304796 -0.0542314 -0.0438286 0.0272326 -0.1361024 -0.0757223 -0.1330816 0.0035649 -0.0292702 0.0917472 0.0537686 0.1093896 0.041231 -0.09186 0.0557569 -0.0923245 0.0751322 -0.1373938 0.0013343 -0.0679747 -0.000598 0.1229166 -0.0365875 -0.0687812 -0.0356072 0.1078677 unknown
polarizability: 159.1971358|-10.7000794|104.9106875|1.4299049|17.0039066|89.6211841 unknown
InChI: InChI=1S/C10H12N2O/c13-10-9(11-6-7-12-10)8-4-2-1-3-5-8/h1-5,9,11-12H,6-7H2
charge 0 multiplicity 1
25 atoms
O  -0.888893 -2.278083 0.006726
N  -1.352398 1.345608 -0.531808
N  -2.62091 -0.847191 0.561186
C  -0.675579 0.051857 -0.754682
C  -2.819664 1.294531 -0.617444
C  -3.322153 0.452008 0.565235
C  0.799344 0.122325 -0.34706
C  -1.391932 -1.115515 -0.013421
C  1.231512 1.014084 0.665227
C  1.74447 -0.729711 -0.968376
C  2.591867 1.055912 1.046022
C  3.103254 -0.690611 -0.585633
C  3.532699 0.20464 0.42193
H  -0.714231 -0.267014 -1.827336
H  -3.19527 0.848743 -1.571602
H  -3.224731 2.318287 -0.536167
H  -0.918612 2.108337 -1.063618
H  -3.127913 0.998572 1.508893
H  -4.410663 0.273311 0.478413
H  -3.047862 -1.643504 1.043211
H  0.492919 1.665753 1.143494
H  1.41135 -1.436487 -1.736525
H  2.916612 1.749125 1.830742
H  3.824778 -1.358069 -1.070222
H  4.587604 0.23679 0.717714
