program: Gaussian 09
title: 000253508
version: EM64L-G09RevD.01
frameworkgroup: C1[X(C18H10O4)]
method: RPBEPBE
basis: SDD
operation: Freq
keyword: #pfreq=noraman
keyword: PBEPBE/SDD
title: #p freq=noraman PBEPBE/SDD
converged: NO YES NO NO
title: Mulliken charges:
elementType: O O O O C C C C C C C C C C C C C C C C C C H H H H H H H H H H
charge: -0.283657 -0.283657 -0.172472 -0.172471 0.201585 0.201586 0.302736 0.302736 0.113246 0.113245 -0.331247 -0.331247 -0.373066 -0.373066 0.080383 0.080383 -0.368114 -0.368114 -0.219190 -0.219191 -0.222686 -0.222686 0.272046 0.272046 0.253521 0.253521 0.268784 0.268784 0.237728 0.237728 0.240404 0.240404
chargesum: 0.00000
title: Mulliken charges with hydrogens summed into heavy atoms:
elementType: O O O O C C C C C C C C C C C C C C C C C C
charge: -0.283657 -0.283657 -0.172472 -0.172471 0.201585 0.201586 0.302736 0.302736 0.113246 0.113245 -0.059201 -0.059201 -0.119545 -0.119545 0.080383 0.080383 -0.099331 -0.099331 0.018537 0.018537 0.017718 0.017718
polarizability: 5.97679837e+02 7.22356576e+00 2.37314616e+02 -2.40319069e-03 -1.88637947e-03 7.72609531e+01
1716.lowfreq: -0.0012 -0.0009 -0.0004 4.5759 8.0071 13.0764 33.0934 38.3731 39.8661
frequency: 33.0934 38.3731 39.8661 91.1164 124.0085 142.8056 151.6925 156.8313 194.9168 203.2770 213.5569 261.7238 302.6183 319.9719 367.2405 416.0095 417.5138 455.8765 488.2249 521.0743 522.7369 537.1304 558.7857 576.3124 613.6314 617.4293 626.7705 640.2198 657.8862 660.4302 676.9002 721.5919 726.4201 760.9333 761.9366 780.4265 780.7001 810.0154 867.1110 868.2067 874.6159 888.5857 888.7504 890.3085 913.1293 970.8750 970.9471 997.7610 1002.8915 1002.9255 1005.7112 1024.5749 1031.4789 1085.3141 1091.0371 1171.2491 1172.3798 1179.4833 1182.7411 1208.1375 1233.2436 1269.0746 1273.6313 1295.3676 1302.6185 1343.4519 1408.0215 1412.1328 1448.0150 1453.5358 1458.4877 1464.3277 1591.8577 1592.0692 1612.1976 1613.9808 1636.0259 1641.4356 1712.9114 1715.5950 3139.4352 3139.4398 3148.9836 3150.7353 3151.1155 3159.7505 3162.0015 3162.1177 3174.6236 3174.7222
redmass: 6.8331 6.2237 6.6811 5.3315 7.1179 5.1448 7.1315 8.7000 5.6950 6.3194 6.7699 6.6357 8.1202 3.4413 6.3919 3.0881 3.3059 4.8623 3.3239 6.7984 8.5733 7.0445 8.2892 9.0997 3.9834 9.8042 5.1030 6.7007 4.8778 4.9119 7.5572 6.4661 6.7016 4.1084 4.3972 1.4291 1.4136 8.2666 6.8135 9.4254 7.5851 1.3931 1.4264 1.6308 1.1445 1.3939 1.3927 6.4929 1.3425 1.3421 3.6948 2.2026 2.3052 2.6647 2.3972 1.2585 1.1470 1.8515 1.6069 2.5334 2.3506 2.2489 1.5392 1.6920 2.0420 2.0469 6.7793 6.2986 2.5908 2.6700 2.6175 2.8825 7.2590 7.3020 7.4488 6.9242 6.6206 9.6861 12.8148 12.9688 1.0863 1.0863 1.0925 1.0900 1.0904 1.0893 1.0959 1.0954 1.1005 1.1005
irintensity: 6.2104 1.1301 3.1766 0.0000 0.0000 1.4900 0.0000 0.0000 0.0000 0.4131 0.1406 13.3360 0.0000 0.0000 3.6353 3.5374 0.0000 4.4673 0.0000 0.0000 6.4713 12.9751 0.0000 0.0000 0.0000 6.2966 5.4630 6.0397 0.0000 58.7391 0.0000 38.6074 0.0000 0.0000 27.8749 0.0009 123.1414 34.2847 0.0001 691.5557 0.0000 0.1237 0.0000 0.0000 50.4520 0.0002 3.8502 0.0000 0.0000 0.0104 30.0122 0.0000 8.0414 38.6971 0.0000 0.0000 19.0737 35.6619 0.0000 0.0000 43.1768 0.0000 31.8786 46.7984 0.0000 0.0000 145.5920 0.0000 161.5308 0.0000 95.9135 0.0000 0.0000 5.1168 61.1594 0.0000 0.0000 88.8790 1200.7848 0.0015 1.1044 2.3143 0.0000 8.7252 0.0000 16.8128 0.0009 13.0078 59.1376 0.0070
temp: 298.150 k
press: 1.00000 atm
elementType: 8 8 8 8 6 6 6 6 6 6 6 6 6 6 6 6 6 6 6 6 6 6 1 1 1 1 1 1 1 1 1 1
symmnumber: 1
zpe: 599922.2 jmol-1
zpe.correction: 0.228498 hartree
zpe.thermalcorrener: 0.245200 hartree
zpe.thermalcorrenthalpy: 0.246144 hartree
zpe.thermalcorrgfe: 0.182735 hartree
zpe.sumelectzpe: -991.346089 hartree
zpe.sumelectthermal: -991.329388 hartree
zpe.sumelectthermalent: -991.328443 hartree
zpe.sumelectthermalfe: -991.391852 hartree
dipole: 0.0000 0.0000 -0.0002
dipole: 0.0002
quadrupole: -90.7545 -136.7422 -129.5405
quadrupole: -37.5704 0.0004 0.0004
quadrupole: 28.2579 -17.7298 -10.5281 -37.5704 0.0004 0.0004
hfenergy: -991.5745873 hartree
pointgroup: C01 [X(C18H10O4)]
dipole: 0.0000026 0.0000024 -0.0000739 debye
polarizability: 597.6562143|7.7905259|237.3382394|0.0024002|0.0018902|77.2609531 unknown
InChI: InChI=1S/C18H10O4/c19-17-13-7-3-1-5-11(13)15(21-17)9-10-16-12-6-2-4-8-14(12)18(20)22-16/h1-10H
charge 0 multiplicity 1
32 atoms
O  -2.049007 -1.562528 -0.000381
O  2.049588 1.562659 -0.000326
O  -3.904576 -3.021975 -0.000358
O  3.905156 3.022106 -0.000241
C  -3.181537 0.48664 -0.000355
C  3.182118 -0.486508 -0.00035
C  -1.866852 -0.150292 -0.000373
C  1.867433 0.150423 -0.000361
C  -4.164617 -0.542106 -0.000365
C  4.165198 0.542237 -0.000328
C  -0.601312 0.39112 -0.000362
C  0.601893 -0.390988 -0.00037
C  -3.570675 1.845327 -0.000309
C  3.571256 -1.845195 -0.000327
C  -3.488063 -1.854944 -0.000457
C  3.488644 1.855076 -0.000414
C  -5.543056 -0.254164 -0.000305
C  5.543637 0.254296 -0.000251
C  -4.952154 2.138149 -0.00027
C  4.952735 -2.138018 -0.000274
C  -5.930645 1.104093 -0.000265
C  5.931226 -1.103962 -0.000231
H  -0.509415 1.482336 -0.000348
H  0.509997 -1.482204 -0.000385
H  -2.830901 2.652163 -0.000299
H  2.831482 -2.652031 -0.000341
H  -6.281225 -1.062288 -0.000313
H  6.281806 1.06242 -0.000233
H  -5.279063 3.183572 -0.000235
H  5.279644 -3.18344 -0.000255
H  -6.993312 1.367723 -0.000232
H  6.993893 -1.367592 -0.000188
