program: Gaussian 09
title: 000253560
version: EM64L-G09RevD.01
frameworkgroup: C1[X(C17H18N6O4)]
method: RPBEPBE
basis: SDD
operation: Freq
keyword: #p
keyword: freq=noraman
keyword: PBEPBE/SDD
title: #p freq=noraman PBEPBE/SDD
converged: YES YES NO NO
title: Mulliken charges:
elementType: O O O O N N N N N N C C C C C C C C C C C C C C C C C H H H H H H H H H H H H H H H H H H
charge: -0.220484 -0.220630 -0.220016 -0.220077 -0.053011 -0.052591 -0.003776 -0.003663 0.023165 0.023146 -0.420216 -0.651832 -0.652777 0.473929 0.474061 -0.386370 -0.386542 -0.374457 -0.374601 -0.358019 -0.358260 0.377361 0.377209 -0.360308 -0.360263 -0.356397 -0.356297 0.263257 0.262898 0.243154 0.251269 0.264788 0.265620 0.243196 0.251298 0.228678 0.228413 0.232165 0.232152 0.267316 0.267539 0.285808 0.285814 0.284198 0.284150
chargesum: 0.00000
title: Mulliken charges with hydrogens summed into heavy atoms:
elementType: O O O O N N N N N N C C C C C C C C C C C C C C C C C
charge: -0.220484 -0.220630 -0.220016 -0.220077 -0.053011 -0.052591 -0.003776 -0.003663 0.023165 0.023146 0.105939 0.107380 0.107337 0.473929 0.474061 -0.157692 -0.158129 -0.142292 -0.142449 -0.090703 -0.090721 0.377361 0.377209 -0.074500 -0.074449 -0.072200 -0.072147
polarizability: 7.34412458e+02 -5.90144076e+01 2.05502848e+02 1.68731289e+00 -4.13046901e-01 1.72173705e+02
1716.lowfreq: -1.9917 -0.0009 -0.0008 0.0003 1.4418 6.4965 8.5997 14.2593 27.3939
frequency: 7.9172 13.7500 27.3886 37.7116 46.9388 53.1168 60.9924 72.4925 74.8185 88.4114 90.0740 140.6773 152.5626 163.7748 175.2873 199.7558 209.9880 211.9646 226.3727 233.5849 278.9714 299.2182 332.4003 336.8788 338.3300 351.5374 369.3732 411.7819 415.1320 415.4024 421.9059 485.2574 491.5495 506.1015 506.6661 508.5905 526.9158 553.1293 578.8607 627.4050 627.6426 661.9464 667.1324 667.2522 672.5406 741.6478 741.8959 774.5374 775.5804 810.2844 819.8758 839.9194 840.6179 864.4421 864.6583 871.9333 872.4274 898.7690 899.8330 986.2397 988.7519 989.1932 999.1044 999.3054 1005.3720 1005.6859 1012.5756 1035.7879 1094.3215 1094.6954 1096.8590 1098.5790 1106.9886 1110.8182 1133.2522 1171.3935 1173.6804 1214.8020 1221.6919 1225.2060 1234.9481 1245.0386 1268.3057 1276.5052 1298.6693 1299.7056 1348.9034 1349.5638 1351.4491 1359.4878 1377.3533 1379.6786 1398.3976 1400.1231 1426.3328 1426.5646 1430.7038 1438.1723 1441.4716 1463.5930 1464.5395 1479.8321 1480.4654 1487.1298 1493.1782 1545.4888 1551.6499 1584.7078 1585.0802 1610.3368 1611.4713 2956.0799 2956.3121 3030.3785 3031.4965 3045.6857 3049.5501 3050.0394 3114.1241 3115.3446 3122.0407 3132.7180 3132.8305 3162.0253 3162.4990 3182.0342 3182.3552 3185.0422 3185.2445
redmass: 8.0910 7.1634 5.3548 6.2614 7.8881 7.4672 4.6125 5.7407 6.0406 5.1010 3.1402 5.0268 2.4883 1.6454 4.7768 1.7010 4.1950 4.2836 2.2160 6.9706 5.5628 5.0797 4.7132 3.2709 3.0018 4.8231 4.5001 6.2155 2.9591 3.0133 3.1887 8.3295 3.2277 3.4798 3.3175 5.0536 5.5291 3.3643 5.1198 7.1427 7.0158 7.0656 4.8024 4.7637 6.3171 4.3077 4.3160 7.9925 8.1985 5.6942 4.8145 1.3300 1.3283 1.3913 1.3956 4.1149 4.1645 1.6483 1.6417 2.0787 1.3597 1.3583 2.9385 2.9215 1.3492 1.3482 2.4763 1.9286 3.1181 3.1350 1.3933 1.3085 1.4135 1.3042 2.2759 1.4899 1.3928 3.1737 4.7127 3.0284 2.9382 2.8676 1.6888 2.3083 1.3669 1.3681 2.1252 4.4336 3.3847 2.0945 2.2615 1.4735 3.3395 2.8397 4.4071 4.4807 1.1478 1.2872 1.2456 1.0505 1.0509 1.8055 1.8806 1.3686 1.3166 5.3428 5.8385 6.9174 6.9257 6.3948 6.3507 1.0370 1.0372 1.1001 1.0999 1.0599 1.0862 1.0853 1.0993 1.0977 1.1065 1.0902 1.0903 1.0886 1.0885 1.0946 1.0946 1.0965 1.0964
irintensity: 2.5604 4.3299 0.4798 0.1654 0.4310 0.7738 0.5640 0.6416 0.4363 4.7022 4.1400 12.8330 1.6432 1.6044 2.9409 1.8219 6.2014 0.6945 0.5560 3.1173 0.5925 5.5300 0.8375 3.8925 4.1641 21.1632 0.1332 1.5513 0.1280 0.0166 16.5609 3.8382 2.4561 5.7890 13.0881 16.0625 0.0010 36.4046 18.7914 0.0351 0.2170 12.8695 25.4446 23.3488 14.3441 0.8573 0.7407 0.6377 16.8544 6.2931 183.2673 5.7058 5.3813 12.6300 12.2642 2.1577 7.3969 62.3733 98.1421 11.6417 0.3940 0.3864 0.3910 3.0906 1.5989 3.1366 1119.3886 32.0603 23.2053 40.0426 2.4749 12.1306 18.5134 17.2314 2.1947 823.5444 21.2687 1825.2892 21.1876 52.6217 2.6178 19.2230 4.0963 63.1060 5.8095 0.4207 59.1809 140.6227 47.3616 374.6463 6.9490 27.9524 121.1307 43.1794 23.1896 31.8719 12.4093 1.8845 14.7697 21.1185 21.2366 9.1030 3.4878 220.2364 5.5299 864.7021 13.3557 83.0093 15.5949 258.3030 4.5583 38.3399 31.9138 30.8467 27.3389 20.0801 52.0054 26.3420 4.5483 1.4777 5.3590 11.2406 11.3867 1.8294 1.7884 0.5424 0.5101 1.6061 1.6083
temp: 298.150 k
press: 1.00000 atm
elementType: 8 8 8 8 7 7 7 7 7 7 6 6 6 6 6 6 6 6 6 6 6 6 6 6 6 6 6 1 1 1 1 1 1 1 1 1 1 1 1 1 1 1 1 1 1
symmnumber: 1
zpe: 888974.2 jmol-1
zpe.correction: 0.338592 hartree
zpe.thermalcorrener: 0.363946 hartree
zpe.thermalcorrenthalpy: 0.364890 hartree
zpe.thermalcorrgfe: 0.278471 hartree
zpe.sumelectzpe: -1285.830736 hartree
zpe.sumelectthermal: -1285.805383 hartree
zpe.sumelectthermalent: -1285.804439 hartree
zpe.sumelectthermalfe: -1285.890858 hartree
dipole: 0.0674 0.1937 1.1350
dipole: 1.1533
quadrupole: -339.1357 -144.4822 -155.2318
quadrupole: 24.5729 -0.9642 -0.4731
quadrupole: -126.1858 68.4677 57.7181 24.5729 -0.9642 -0.4731
hfenergy: -1286.1693288 hartree
pointgroup: C01 [X(C17H18N6O4)]
dipole: 0.0333103 0.4438971 -0.0879916 debye
polarizability: 721.3415837|4.0437996|172.2424095|101.0519611|1.8743188|218.5050171 unknown
InChI: InChI=1S/C17H18N6O4/c1-20(18-11-14-3-7-16(8-4-14)22(24)25)13-21(2)19-12-15-5-9-17(10-6-15)23(26)27/h3-12H,13H2,1-2H3
charge 0 multiplicity 1
45 atoms
O  9.140434 -0.702736 0.662789
O  -9.15823 -0.690432 -0.365736
O  8.677464 0.873589 2.249892
O  -8.71673 0.655639 -2.157721
N  0.920417 1.720928 -0.933023
N  -0.890341 1.840045 0.741513
N  2.169723 1.575412 -0.403879
N  -2.147467 1.634316 0.252377
N  8.347273 0.151212 1.227103
N  -8.370314 0.071872 -1.054936
C  0.01293 2.576387 -0.154325
C  0.403473 0.906872 -2.046627
C  -0.368153 1.190583 1.956155
C  4.38798 0.612026 -0.376838
C  -4.37463 0.699662 0.394424
C  3.045829 0.736694 -0.946287
C  -3.021812 0.888019 0.918807
C  5.307125 -0.312213 -0.957268
C  -5.288529 -0.129691 1.110747
C  4.813097 1.38616 0.746661
C  -4.816735 1.321162 -0.814158
C  6.989669 0.309703 0.674747
C  -6.999786 0.287208 -0.556343
C  6.603594 -0.468883 -0.440004
C  -6.596484 -0.340446 0.644245
C  6.103538 1.239542 1.273221
C  -6.119027 1.119441 -1.291029
H  0.656851 3.250172 0.432534
H  -0.633823 3.153135 -0.833892
H  0.460383 -0.177001 -1.818716
H  0.974601 1.099801 -2.975306
H  -0.65227 1.16985 -2.212298
H  0.691577 1.46414 2.071673
H  -0.436628 0.085843 1.887346
H  -0.927786 1.520764 2.852728
H  2.818074 0.113811 -1.826869
H  -2.784242 0.392492 1.874409
H  4.995933 -0.910774 -1.821633
H  -4.964255 -0.610712 2.041189
H  4.110523 2.10026 1.185488
H  -4.117992 1.963642 -1.35732
H  7.318121 -1.173081 -0.874046
H  -7.307494 -0.973296 1.181579
H  6.446678 1.82318 2.131563
H  -6.47526 1.587699 -2.212435
