program: Gaussian 09
title: 000253600
version: EM64L-G09RevD.01
frameworkgroup: C1[X(C29H24N2O3)]
method: RPBEPBE
basis: SDD
operation: Freq
keyword: #p
keyword: freq=noraman
keyword: PBEPBE/SDD
title: #p freq=noraman PBEPBE/SDD
converged: YES YES NO NO
title: Mulliken charges:
elementType: O O O N N C C C C C C C C C C C C C C C C C C C C C C C C C C C C C H H H H H H H H H H H H H H H H H H H H H H H H
charge: -0.242228 -0.263688 -0.265238 -0.366422 -0.358231 0.110559 0.089825 0.135108 0.370468 0.370402 0.414430 0.418745 -0.371523 -0.368347 -0.345598 -0.371915 -0.346956 -0.349975 -0.355255 -0.352713 -0.383996 -0.361180 -0.363459 -0.375794 0.313928 0.317167 -0.219886 -0.221848 -0.223901 -0.224350 -0.248423 -0.249497 -0.537520 -0.538137 0.217966 0.248170 0.254938 0.235978 0.262442 0.262248 0.276702 0.275568 0.240806 0.242010 0.252391 0.251557 0.225737 0.226581 0.226963 0.227131 0.227692 0.227638 0.220535 0.223108 0.246585 0.223341 0.223079 0.246280
chargesum: 0.00000
title: Mulliken charges with hydrogens summed into heavy atoms:
elementType: O O O N N C C C C C C C C C C C C C C C C C C C C C C C C C C C C C
charge: -0.242228 -0.263688 -0.265238 -0.366422 -0.358231 0.110559 0.089825 0.135108 0.370468 0.370402 0.414430 0.418745 -0.153557 -0.120177 -0.090660 -0.135937 -0.084514 -0.087727 -0.078554 -0.077145 -0.143190 -0.119170 -0.111068 -0.124237 0.313928 0.317167 0.005852 0.004733 0.003062 0.002781 -0.020731 -0.021858 0.152709 0.154564
polarizability: 4.71900793e+02 2.31770600e+00 3.87800245e+02 1.09973919e-01 4.29049834e+01 2.29892952e+02
1716.lowfreq: -8.9913 -4.1903 -0.0006 -0.0005 0.0001 6.3165 11.6466 22.0798 28.1645
frequency: 11.1934 22.0216 28.0184 35.2456 38.0128 48.3323 53.4312 63.9279 70.3178 82.5844 85.5029 94.9933 116.6014 134.3953 166.8904 174.7956 181.0807 189.2753 213.3062 222.3662 234.2682 235.4369 240.3880 261.1024 289.8524 302.4720 318.8513 331.5793 371.8621 402.6207 406.2488 408.2609 410.7440 412.3408 420.4164 437.1814 466.3873 479.1565 501.2242 509.1924 511.1018 536.3790 538.3659 585.3669 589.5648 612.9608 614.0774 620.1037 634.8334 654.7404 677.8957 693.3834 694.1853 705.6928 707.9472 731.2063 745.3200 748.3895 758.0510 766.8257 780.8982 792.0561 809.4771 820.7184 835.0738 835.7124 836.4699 844.8309 846.1515 909.7297 911.2457 930.8073 942.4191 948.8346 964.6768 967.2312 967.9733 971.3274 986.6832 987.8438 988.1233 988.4140 989.7726 989.7918 997.7181 1003.6458 1005.2106 1026.5388 1037.6339 1079.8578 1080.3618 1107.6507 1111.8098 1112.7549 1114.1036 1124.6469 1133.9416 1150.9967 1156.1494 1158.6957 1172.3720 1172.4975 1178.0431 1183.6605 1188.8093 1189.4042 1230.1373 1234.9657 1242.8088 1297.6121 1303.9189 1319.7875 1322.5999 1334.6462 1346.7070 1351.6468 1366.8415 1371.9518 1382.8555 1384.7749 1417.8566 1420.7605 1436.2660 1437.0672 1442.6344 1445.3175 1467.1459 1467.2350 1471.9964 1472.7919 1486.0001 1489.0212 1494.7078 1508.8432 1570.1492 1572.2199 1585.8480 1593.6084 1604.9103 1610.9450 1611.9248 1623.4611 1627.0035 1654.6452 2959.9132 2961.0720 3047.8395 3049.9628 3126.1647 3126.7567 3128.8746 3129.1952 3138.8645 3140.4640 3140.7150 3141.4648 3143.9579 3150.3486 3157.7064 3158.0609 3164.3707 3168.4310 3170.1576 3170.3829 3171.5621 3173.5648 3184.8419 3185.9040
redmass: 4.5702 4.7262 4.6731 5.0242 5.4770 4.0940 3.6805 4.5684 4.2257 6.2567 4.1752 3.7188 4.5031 4.9974 3.7224 4.3704 4.1148 5.7039 3.4850 3.6078 2.9738 1.6882 1.3771 3.9912 4.2666 5.9034 6.2067 6.4861 5.9386 6.2293 3.6438 2.9506 4.1889 3.0112 3.0879 5.3675 4.5375 5.6472 3.9354 3.3716 3.4872 2.8171 3.4468 6.3510 6.0497 6.4018 6.4112 7.1662 7.0818 6.9757 4.8397 2.4172 1.9737 8.4197 3.6637 3.9661 2.7651 3.7575 2.4176 3.3097 3.1758 3.9793 1.3577 1.3604 1.9258 1.3469 1.2549 1.7790 2.9897 1.4303 1.4341 1.3934 8.0826 1.3721 1.3492 1.3875 1.3883 1.3545 8.0102 2.6747 3.7978 2.3110 2.2856 2.1038 5.2822 2.7707 2.9955 2.2004 1.9577 1.8168 1.7473 1.3812 1.2602 1.2605 1.5015 2.8777 3.8853 3.7289 1.3316 1.3682 1.0492 1.0491 1.2415 1.2320 1.1219 1.1397 3.0681 3.0237 4.7916 1.2991 1.3159 1.4071 1.3505 4.8964 4.6521 4.0517 5.4807 4.8913 8.9783 8.9039 3.8672 3.9297 1.1841 1.1853 2.3514 2.3289 1.0499 1.0500 1.0739 1.0885 2.4229 2.3507 2.5987 2.8706 7.0933 7.1597 6.7950 6.5314 7.4495 6.1186 6.5109 6.5314 7.3036 12.0361 1.0330 1.0329 1.1039 1.1041 1.0993 1.0994 1.0850 1.0850 1.0887 1.0900 1.0898 1.0883 1.0886 1.0868 1.0948 1.0952 1.0952 1.0958 1.0974 1.0967 1.0970 1.0961 1.0964 1.0963
irintensity: 0.9201 0.5263 0.2049 0.3998 1.7043 0.1266 0.3628 1.4134 2.1704 0.3696 0.0206 5.7585 2.9292 2.7389 1.4595 0.4882 1.0850 1.3684 2.6916 0.6983 1.3008 1.0698 0.7090 4.3470 3.0948 2.8139 0.1355 4.0998 0.6976 0.1983 0.6426 1.6156 1.5078 0.1950 0.3002 0.7471 1.5393 5.1212 3.7298 19.7464 2.6477 36.2006 37.0952 26.8844 1.5370 0.0367 0.6511 5.0850 0.9838 8.1002 13.7736 19.7047 72.5386 0.6777 2.4231 1.1262 1.2658 8.5002 80.4286 55.2188 32.7035 5.5355 13.1497 11.6981 37.0375 15.7500 2.5153 65.5291 16.4810 4.7390 1.9099 0.8433 4.5101 0.6894 1.1995 0.8983 0.9870 0.3493 49.1076 9.7347 29.4671 2.9312 3.0012 0.1934 1.1295 20.3047 24.3245 10.9932 0.2030 13.1826 2.8594 7.9960 0.1858 0.1810 12.1465 29.8428 5.7603 25.9411 1.1438 0.7471 0.1843 0.0930 84.0152 102.6724 0.4866 0.1488 205.1028 236.0769 82.1846 7.2851 4.4374 2.4426 0.6034 351.8552 23.4314 55.1829 63.1312 49.1072 0.1035 7.2358 3.0936 7.8747 9.7330 13.5028 15.5097 1.3341 13.0785 13.0907 67.8798 73.8965 256.2780 99.7332 15.2483 135.6179 6.9616 31.5046 5.3569 0.6426 19.4110 89.1321 31.5628 37.9134 105.0491 383.9978 75.6757 70.4977 44.1583 42.7390 28.7841 29.0067 0.4330 0.4258 4.1765 13.7249 15.6062 18.3090 6.7931 12.4406 48.3231 37.7366 12.2157 6.4101 10.2116 13.2293 8.0041 3.9540 1.7797 1.9713
temp: 298.150 k
press: 1.00000 atm
elementType: 8 8 8 7 7 6 6 6 6 6 6 6 6 6 6 6 6 6 6 6 6 6 6 6 6 6 6 6 6 6 6 6 6 6 1 1 1 1 1 1 1 1 1 1 1 1 1 1 1 1 1 1 1 1 1 1 1 1
symmnumber: 1
zpe: 1190435.2 jmol-1
zpe.correction: 0.453413 hartree
zpe.thermalcorrener: 0.482799 hartree
zpe.thermalcorrenthalpy: 0.483743 hartree
zpe.thermalcorrgfe: 0.390253 hartree
zpe.sumelectzpe: -1452.298877 hartree
zpe.sumelectthermal: -1452.269491 hartree
zpe.sumelectthermalent: -1452.268547 hartree
zpe.sumelectthermalfe: -1452.362037 hartree
dipole: -1.2309 5.4249 -0.1437
dipole: 5.5647
quadrupole: -166.5787 -194.0580 -185.9173
quadrupole: 0.3386 13.3520 9.5295
quadrupole: 15.6060 -11.8734 -3.7326 0.3386 13.3520 9.5295
hfenergy: -1452.7522899 hartree
pointgroup: C01 [X(C29H24N2O3)]
dipole: -0.4033349 -2.1516601 -0.0279861 debye
polarizability: 471.803043|1.9062627|383.7847125|-6.255094|49.4436348|234.0062352 unknown
InChI: InChI=1S/C29H24N2O3/c1-33-25-17-13-21(14-18-25)27-28(22-15-19-26(34-2)20-16-22)31(24-11-7-4-8-12-24)29(32)30(27)23-9-5-3-6-10-23/h3-20H,1-2H3
charge 0 multiplicity 1
58 atoms
O  -0.064885 3.70295 0.550333
O  4.550857 -3.95437 0.406337
O  -4.118651 -4.297918 -0.138651
N  1.132625 1.651827 0.134876
N  -1.114746 1.577738 0.11159
C  0.751374 0.297982 -0.134045
C  -0.639097 0.254333 -0.156112
C  -0.020929 2.465131 0.31446
C  1.725863 -0.811874 -0.057036
C  -1.544726 -0.916893 -0.142558
C  2.455626 2.204775 0.044897
C  -2.474758 2.034174 0.047476
C  1.796525 -1.835372 -1.033213
C  -2.386039 -1.153234 0.976029
C  2.632261 -0.877214 1.04366
C  -1.619107 -1.824583 -1.234665
C  3.35332 1.745393 -0.951265
C  -3.349798 1.540018 -0.951887
C  2.853919 3.228857 0.939456
C  -2.934816 3.000668 0.976166
C  2.715099 -2.903254 -0.921958
C  -3.255677 -2.262082 1.023866
C  3.552556 -1.927558 1.166921
C  -2.478215 -2.936309 -1.203413
C  3.596148 -2.951331 0.18522
C  -3.297959 -3.163234 -0.070184
C  4.649372 2.295491 -1.035818
C  -4.683224 1.997522 -1.005995
C  4.14849 3.781492 0.836103
C  -4.266686 3.461293 0.903667
C  5.054579 3.315645 -0.144276
C  -5.149512 2.959625 -0.080397
C  4.629071 -5.042183 -0.571493
C  -4.992509 -4.573844 1.0050
H  1.141431 -1.791012 -1.907917
H  -2.354747 -0.462284 1.82548
H  2.603913 -0.097018 1.811404
H  -1.021429 -1.636888 -2.132272
H  3.038571 0.96755 -1.652642
H  -2.98949 0.809423 -1.681298
H  2.147731 3.60034 1.685575
H  -2.247518 3.400866 1.725207
H  2.735719 -3.674106 -1.697928
H  -3.884648 -2.412143 1.906156
H  4.244399 -1.981952 2.012642
H  -2.53893 -3.634092 -2.043838
H  5.338765 1.931859 -1.805794
H  -5.353661 1.608483 -1.780296
H  4.448068 4.577658 1.526463
H  -4.613326 4.214213 1.620091
H  6.059813 3.744915 -0.216556
H  -6.183389 3.318305 -0.130193
H  4.905108 -4.662823 -1.574717
H  3.672208 -5.596156 -0.634278
H  5.419873 -5.708558 -0.197264
H  -5.713832 -3.74982 1.16876
H  -4.405215 -4.742987 1.928322
H  -5.534163 -5.492541 0.736598
