program: Gaussian 09
title: 000253559
version: EM64L-G09RevD.01
frameworkgroup: C1[X(C17H18Cl2N4)]
method: RPBEPBE
basis: SDD
operation: Freq
keyword: #p
keyword: freq=noraman
keyword: PBEPBE/SDD
title: #p freq=noraman PBEPBE/SDD
converged: YES YES NO NO
title: Mulliken charges:
elementType: Cl Cl N N N N C C C C C C C C C C C C C C C C C H H H H H H H H H H H H H H H H H H
charge: -0.093516 -0.079893 -0.065794 -0.059828 -0.018174 -0.006837 -0.438133 -0.577213 -0.640144 0.505142 0.511325 -0.316747 -0.369407 -0.298954 -0.294002 -0.364119 -0.360333 -0.233968 -0.231257 -0.227737 -0.229248 -0.231011 -0.229484 0.241479 0.254788 0.247684 0.214243 0.245594 0.233800 0.250115 0.246824 0.202275 0.242594 0.271382 0.264648 0.253584 0.254225 0.229521 0.228925 0.233747 0.233905
chargesum: 0.00000
title: Mulliken charges with hydrogens summed into heavy atoms:
elementType: Cl Cl N N N N C C C C C C C C C C C C C C C C C
charge: -0.093516 -0.079893 -0.065794 -0.059828 -0.018174 -0.006837 0.058134 0.130308 0.090596 0.505142 0.511325 -0.114473 -0.126813 -0.298954 -0.294002 -0.092737 -0.095685 0.019616 0.022967 0.001784 -0.000323 0.002736 0.004421
polarizability: 4.43330012e+02 4.52489905e+01 2.31380058e+02 7.95381838e+00 -3.97397518e+00 1.61715064e+02
1716.lowfreq: -5.5830 -0.0012 -0.0004 0.0003 1.8316 8.3776 10.6623 14.9591 23.4040
frequency: 7.9832 14.5251 23.0652 38.0967 61.2951 65.7214 79.8817 91.9954 96.7984 118.9940 147.5466 152.5147 166.1365 189.2181 211.5402 216.4164 248.7479 262.9359 270.3140 306.3544 323.2638 337.0088 347.5404 380.5882 385.3828 400.5178 419.6250 450.0200 452.1552 473.0372 501.6737 535.2017 537.3767 548.7533 581.0315 614.0324 627.8600 677.0068 685.7255 722.5529 725.6946 759.0200 760.5359 805.7193 811.8282 867.8170 868.6801 869.9577 873.0902 889.6465 895.4655 950.8269 952.7739 963.8405 991.7156 992.5217 998.2367 1007.3834 1015.2926 1025.8541 1035.9366 1038.1264 1095.7668 1109.8014 1116.3098 1118.4276 1132.7220 1167.3874 1168.1061 1206.3580 1218.2640 1223.8692 1250.1627 1264.6482 1287.9786 1291.7517 1340.3170 1348.7379 1367.3427 1371.8421 1382.7966 1396.8045 1422.2236 1424.8609 1426.6460 1433.2767 1443.6065 1458.2722 1462.4865 1464.5963 1466.0624 1487.3066 1491.0297 1546.6837 1552.3676 1569.9062 1572.6441 1603.3821 1603.7646 2952.2825 2974.4886 3027.6267 3028.8186 3059.7755 3078.6078 3087.4090 3095.6967 3115.1760 3124.5306 3134.5740 3135.7610 3151.0648 3152.1523 3163.7034 3164.9510 3175.6996 3176.3059
redmass: 6.2454 9.1018 7.4775 4.9343 6.5535 2.9126 2.7218 2.6953 1.7563 4.1968 3.2718 5.8915 3.3968 5.0623 1.9038 5.9955 5.0287 3.1180 3.7226 3.5057 2.4771 4.9095 4.3949 5.0071 7.7234 6.2368 4.7648 3.3999 3.4405 3.5908 2.7343 3.6049 3.5935 3.4050 4.9722 6.0457 5.5369 6.8280 6.4172 3.7073 3.7179 1.2468 1.2505 5.3544 4.9956 2.0611 1.8297 2.0264 2.2799 1.5811 1.5506 1.3699 1.3696 2.0388 1.3444 1.3371 3.8595 5.7851 4.4672 2.1690 1.9449 1.9418 1.4160 1.5904 1.5262 1.6405 1.9171 1.0624 1.0628 2.5449 2.0293 1.7953 2.1306 2.5830 1.7234 1.5989 1.5901 2.5302 2.0353 1.9398 2.5347 1.7383 1.2629 2.2536 2.0640 1.2938 1.2041 1.1662 1.8333 1.2265 2.0383 1.0961 1.1165 5.6246 5.8753 5.7536 5.5969 7.1110 7.0211 1.0389 1.0382 1.0730 1.0838 1.0973 1.0858 1.0874 1.1049 1.0961 1.0999 1.0857 1.0857 1.0901 1.0901 1.0952 1.0951 1.0997 1.0997
irintensity: 0.1714 0.2402 0.3052 0.1273 2.4069 3.8144 3.3741 0.3743 1.4585 4.0789 3.3123 2.6785 0.2069 2.8971 1.6964 0.2969 1.4352 13.6686 2.2227 1.5939 4.3891 5.9625 5.6392 3.3560 5.7910 3.1147 0.4438 9.8164 11.1642 3.1961 9.8145 1.3839 2.3774 33.9718 37.8459 11.8791 11.4731 24.2698 13.4428 4.0088 4.4786 76.2258 80.1255 80.6969 63.4421 14.6605 1.1214 14.4035 4.0574 41.0943 43.8005 5.2822 3.9706 21.5382 5.4952 2.4253 260.7548 127.8601 279.8019 25.3463 0.9110 0.5080 27.4678 7.3028 10.8244 2.0892 19.3308 0.0661 0.0141 152.0330 2.2771 1.8585 66.7549 63.1535 2.0326 12.6686 32.1119 82.4002 36.7347 50.2649 25.3562 37.1454 12.6160 30.6223 44.3162 6.6939 20.8320 22.7028 24.1461 17.6457 20.2991 16.4135 42.2312 275.8835 75.8378 96.5866 95.5210 9.5777 4.5492 30.0710 76.7483 18.5316 49.1013 35.8129 60.4560 26.0212 6.1236 7.5240 17.8455 3.1658 3.5054 7.6624 8.0774 11.8924 9.9942 21.0753 19.6049
temp: 298.150 k
press: 1.00000 atm
elementType: 17 17 7 7 7 7 6 6 6 6 6 6 6 6 6 6 6 6 6 6 6 6 6 1 1 1 1 1 1 1 1 1 1 1 1 1 1 1 1 1 1
symmnumber: 1
zpe: 831150.6 jmol-1
zpe.correction: 0.316569 hartree
zpe.thermalcorrener: 0.339326 hartree
zpe.thermalcorrenthalpy: 0.340270 hartree
zpe.thermalcorrgfe: 0.260011 hartree
zpe.sumelectzpe: -1795.992077 hartree
zpe.sumelectthermal: -1795.969320 hartree
zpe.sumelectthermalent: -1795.968376 hartree
zpe.sumelectthermalfe: -1796.048635 hartree
dipole: -0.0757 -1.9190 -0.4956
dipole: 1.9834
quadrupole: -141.1937 -144.3709 -148.7059
quadrupole: 8.1443 4.9061 -0.9985
quadrupole: 3.5632 0.3859 -3.9491 8.1443 4.9061 -0.9985
hfenergy: -1796.308646 hartree
pointgroup: C01 [X(C17H18Cl2N4)]
dipole: -0.305469 -0.4679511 -0.5446518 debye
polarizability: 364.1990979|-98.5763113|224.9984193|-65.0614975|64.014472|247.2276168 unknown
InChI: InChI=1S/C17H18Cl2N4/c1-22(20-11-14-7-3-5-9-16(14)18)13-23(2)21-12-15-8-4-6-10-17(15)19/h3-12H,13H2,1-2H3
charge 0 multiplicity 1
41 atoms
Cl -3.407282 1.088819 3.715885
Cl 5.225206 -0.041528 0.927669
N  -1.710676 -1.207158 -0.712888
N  0.213744 -1.597113 0.84948
N  -2.504959 -0.115486 -0.480805
N  1.267381 -1.900842 0.025012
C  -1.088032 -2.050166 0.33355
C  -1.210476 -1.324588 -2.093318
C  0.336286 -0.671907 1.989028
C  -3.780504 1.384033 0.920711
C  3.592476 -1.768063 -0.614127
C  -2.869264 0.249422 0.739671
C  2.471199 -1.395261 0.256358
C  -4.124924 1.87499 2.20933
C  4.89808 -1.235535 -0.433516
C  -4.370766 2.060453 -0.191386
C  3.429366 -2.689488 -1.694505
C  -4.997185 2.958909 2.413018
C  5.986645 -1.575157 -1.257272
C  -5.24211 3.149064 -0.013374
C  4.502214 -3.042823 -2.531364
C  -5.562871 3.603636 1.290204
C  5.788225 -2.487248 -2.317546
H  -1.791178 -2.155159 1.17756
H  -0.918772 -3.039531 -0.122182
H  -1.923474 -0.812894 -2.756832
H  -1.138496 -2.389653 -2.375693
H  -0.208611 -0.868556 -2.211626
H  -0.601734 -0.67189 2.564183
H  0.552024 0.367316 1.665359
H  1.151431 -1.003804 2.660838
H  -2.531905 -0.252124 1.657879
H  2.689235 -0.693512 1.073524
H  -4.115143 1.693635 -1.190238
H  2.431325 -3.113283 -1.843234
H  -5.227012 3.292875 3.42877
H  6.969988 -1.13394 -1.071595
H  -5.677517 3.645303 -0.887429
H  4.342835 -3.752395 -3.350514
H  -6.243704 4.448484 1.436582
H  6.629334 -2.758337 -2.963965
