program: Gaussian 09
title: 000253643
version: EM64L-G09RevD.01
frameworkgroup: C1[X(C16H18FN5O7)]
method: RPBEPBE
basis: SDD
operation: Freq
keyword: #p
keyword: freq=noraman
keyword: PBEPBE/SDD
title: #p freq=noraman PBEPBE/SDD
converged: YES YES NO NO
title: Mulliken charges:
elementType: F O O O O O O O N N N N N C C C C C C C C C C C C C C C C H H H H H H H H H H H H H H H H H H
charge: -0.155749 -0.248593 -0.276810 -0.293509 -0.263503 -0.224324 -0.238869 -0.244865 -0.187484 -0.034070 -0.077064 -0.053976 -0.586029 -0.158665 -0.054709 -0.132441 -0.098022 -0.367758 0.198722 -0.204173 -0.130836 0.301279 0.312281 0.136181 -0.756781 0.327807 -0.757583 0.015592 -0.767283 0.316496 0.314431 0.289844 0.304575 0.255584 0.259604 0.300663 0.253979 0.256268 0.254053 0.257873 0.254714 0.256680 0.243042 0.241797 0.285121 0.333532 0.342980
chargesum: 0.00000
title: Mulliken charges with hydrogens summed into heavy atoms:
elementType: F O O O O O O O N N N N N C C C C C C C C C C C C C C C C
charge: -0.155749 -0.248593 -0.276810 -0.293509 -0.263503 -0.224324 -0.238869 -0.244865 -0.187484 -0.034070 -0.077064 -0.053976 0.090483 0.157831 0.259722 0.157403 0.206552 0.147429 0.198722 0.096490 -0.130836 0.301279 0.312281 0.136181 0.007519 0.327807 0.011684 0.015592 0.002677
polarizability: 3.02127951e+02 -1.75643558e+01 2.32628565e+02 1.38552166e+01 -2.18217288e+01 1.65655858e+02
1716.lowfreq: -44.5576 -6.6922 -3.9308 -0.8738 -0.0009 -0.0009 -0.0007 16.1996 21.1594
frequency: -44.5289 16.1010 21.0442 27.5694 31.6002 35.3611 39.3203 48.3664 58.3243 69.5453 77.2978 78.6907 92.1348 107.4613 115.9519 119.5892 121.9752 156.6436 168.2878 196.1457 207.1320 217.8847 228.9692 256.9497 276.3772 290.7451 292.4088 315.5061 332.9640 347.0355 369.9414 391.6007 421.7307 449.9950 476.3253 478.5312 481.3357 518.9221 519.5845 545.2388 563.2046 563.7656 565.6034 605.8384 620.4815 626.1538 628.0293 637.8685 651.7948 657.1477 710.3962 713.6524 729.9058 765.9691 777.0036 782.2538 792.6232 820.7736 846.2417 848.3148 859.5610 878.4069 943.5311 957.7387 964.1063 969.9429 972.7556 988.9590 992.6193 1000.3666 1002.7664 1027.9442 1041.2443 1043.9092 1044.3042 1048.1091 1051.2239 1087.7710 1097.0726 1144.7369 1175.7927 1177.6130 1184.9446 1187.2590 1200.4589 1215.8721 1237.6135 1254.9132 1279.0901 1285.3902 1291.8575 1302.3539 1318.7096 1325.2226 1355.9782 1358.7128 1366.3969 1381.6301 1386.7215 1388.0034 1391.0424 1410.3341 1446.9388 1450.8637 1452.0746 1452.3371 1453.3321 1454.0523 1454.1129 1459.0761 1508.2999 1526.5983 1605.4232 1617.3423 1659.6031 1661.0219 1667.4467 3005.3894 3007.9743 3008.0534 3047.5412 3052.0795 3071.8237 3078.5882 3085.7323 3096.2665 3098.5545 3101.4039 3130.3618 3141.4855 3145.5901 3145.6510 3245.1369 3564.1635 3721.7690
redmass: 1.0687 6.4765 7.1191 5.6758 3.3135 1.6181 7.8611 7.0592 4.2635 4.3101 3.8015 3.6377 4.2577 5.5552 4.1449 1.2932 3.9001 6.9600 6.6869 6.6890 8.0853 7.1038 9.2262 7.6853 4.5070 3.5410 7.2962 4.4336 4.0547 4.5788 3.8755 3.9399 5.1534 3.9434 1.5324 3.7133 5.0969 2.9865 1.1523 8.3404 3.1916 3.2507 3.3051 5.8297 6.3648 6.7839 5.7940 6.1986 6.4348 6.2038 6.2704 10.0970 4.7821 5.1748 8.8846 5.3093 9.0906 5.5603 1.6555 2.7635 3.9172 4.5218 4.8444 5.6143 4.1421 3.5274 7.8363 2.7111 2.4115 3.0434 2.3142 4.0368 2.1151 1.7724 1.8577 1.6788 2.1305 3.2319 1.5036 4.0557 3.2566 2.7804 3.3098 2.7760 3.2774 1.7137 1.5455 1.2217 1.4955 1.6309 1.8023 1.2176 2.4469 2.3480 1.7038 1.2818 3.8548 1.2425 1.3256 1.2649 1.8023 3.2514 3.2892 1.0828 1.1490 1.0571 1.0602 1.0499 1.0488 1.0567 2.8805 10.3958 3.3063 2.4332 9.4306 9.7471 9.9686 1.0377 1.0382 1.0377 1.0584 1.0857 1.0866 1.0861 1.0877 1.0967 1.0955 1.0946 1.1083 1.1022 1.1014 1.1009 1.0994 1.0444 1.1061
irintensity: 1.6913 0.2707 0.3901 0.0912 0.6369 2.1678 1.2214 1.3018 1.4326 2.1993 2.9407 4.8318 1.0171 0.4069 0.6913 0.8259 1.0679 3.0666 2.2147 4.5544 4.7174 8.9081 0.8502 1.2373 10.6368 16.1288 0.3101 3.1747 9.9093 0.7265 26.9056 12.7323 3.6399 2.5999 213.4220 76.6837 21.3684 9.2541 3.6754 4.3981 2.8587 3.2106 5.5711 18.1663 18.6080 7.1171 1.1328 10.3701 13.6320 4.2444 22.2406 1.5309 52.2530 9.9655 25.0724 6.0589 7.0705 11.8056 7.4617 18.1283 123.7157 38.1104 141.9146 51.7582 10.0030 33.7640 3.3699 26.1388 90.0133 99.3988 164.4608 124.3727 40.9584 24.6012 2.4707 23.6032 28.8402 12.7044 12.6579 53.8045 95.7075 134.7607 240.7481 215.3604 390.8624 116.2687 39.2111 5.5402 31.2662 15.6393 11.8040 4.8312 11.7551 9.9884 43.2321 3.4978 85.3177 68.1991 67.3722 64.3138 11.2722 53.7473 114.8292 35.5266 13.6523 12.8163 14.0604 15.2038 15.9459 23.9692 98.0763 228.6665 88.6551 840.1508 173.5426 186.8285 140.0858 3.8466 0.6088 0.4733 14.9981 5.1758 6.4414 8.9784 4.4680 3.8587 5.0818 5.2608 5.3160 8.4755 6.0432 9.4324 23.9117 159.4768 54.6473
temp: 298.150 k
press: 1.00000 atm
elementType: 9 8 8 8 8 8 8 8 7 7 7 7 7 6 6 6 6 6 6 6 6 6 6 6 6 6 6 6 6 1 1 1 1 1 1 1 1 1 1 1 1 1 1 1 1 1 1
symmnumber: 1
zpe: 903878.4 jmol-1
zpe.correction: 0.344269 hartree
zpe.thermalcorrener: 0.372332 hartree
zpe.thermalcorrenthalpy: 0.373276 hartree
zpe.thermalcorrgfe: 0.280983 hartree
zpe.sumelectzpe: -1518.543698 hartree
zpe.sumelectthermal: -1518.515635 hartree
zpe.sumelectthermalent: -1518.514691 hartree
zpe.sumelectthermalfe: -1518.606984 hartree
dipole: 3.3039 5.8880 0.7322
dipole: 6.7911
quadrupole: -178.1938 -147.2983 -178.3226
quadrupole: -21.4216 12.9891 -9.4577
quadrupole: -10.2556 20.6399 -10.3844 -21.4216 12.9891 -9.4577
hfenergy: -1518.8879671 hartree
pointgroup: C01 [X(C16H18F1N5O7)]
dipole: -1.4912038 0.6609829 -2.1161635 debye
polarizability: 292.0011192|35.5272865|210.8507277|-3.9382989|-41.7390269|197.5605258 unknown
InChI: InChI=1S/C16H18FN5O7/c1-6(23)26-4-9-11(27-7(2)24)12(28-8(3)25)15(29-9)22-5-19-10-13(17)20-16(18)21-14(10)22/h5,9,11-12,15H,4,18H2,1-3H3
charge 0 multiplicity 1
47 atoms
F  6.161645 -0.193462 1.563591
O  -0.422544 1.298836 0.834669
O  -0.95696 0.323224 -2.188206
O  -1.19808 -1.771064 0.846362
O  -4.097776 0.974683 0.058574
O  -1.330586 -1.789041 -3.10804
O  -3.446346 -2.241288 1.24898
O  -4.503338 1.220917 2.342433
N  1.666034 0.221669 0.319117
N  3.13582 -1.009351 1.594219
N  3.230395 1.876961 -0.639258
N  5.539174 1.512568 0.121814
N  5.001595 3.261809 -1.336791
C  -0.443749 -0.334968 -0.959755
C  -1.62051 -0.627546 -0.007215
C  0.419399 0.734743 -0.242901
C  -1.76303 0.656006 0.833513
C  -2.787511 1.650797 0.245331
C  2.920798 0.809902 0.132093
C  1.861291 -0.859712 1.214729
C  3.822967 0.026789 0.926461
C  -1.386219 -0.548281 -3.220276
C  -2.243755 -2.523655 1.427868
C  5.161614 0.466522 0.855057
C  -1.900894 0.248898 -4.392953
C  -4.85963 0.773537 1.231144
C  -1.682423 -3.651161 2.25803
C  4.56772 2.188406 -0.599901
C  -6.076735 -0.063039 0.931586
H  0.101413 -1.254064 -1.228968
H  -2.553168 -0.894657 -0.529464
H  0.703451 1.54252 -0.940035
H  -2.020339 0.434446 1.882088
H  -2.495531 1.980664 -0.762969
H  -2.898738 2.511107 0.926088
H  1.029329 -1.481653 1.535177
H  -1.21273 1.075333 -4.634181
H  -2.879278 0.695023 -4.137772
H  -2.02468 -0.411194 -5.263302
H  -0.963027 -4.243866 1.6684
H  -2.501284 -4.294635 2.609437
H  -1.13963 -3.244522 3.130036
H  -6.84223 0.097151 1.705119
H  -6.481059 0.163289 -0.067327
H  -5.768402 -1.124839 0.947427
H  4.330988 3.803096 -1.874873
H  5.987348 3.507802 -1.314056
