program: Gaussian 09
title: 000253645
version: EM64L-G09RevD.01
frameworkgroup: C1[X(C16H19N5O7)]
method: RPBEPBE
basis: SDD
operation: Freq
keyword: #p
keyword: freq=noraman
keyword: PBEPBE/SDD
title: #p freq=noraman PBEPBE/SDD
converged: YES YES NO NO
title: Mulliken charges:
elementType: O O O O O O O N N N N N C C C C C C C C C C C C C C C C H H H H H H H H H H H H H H H H H H H
charge: -0.252688 -0.262335 -0.270130 -0.248145 -0.246068 -0.222662 -0.253656 -0.217921 -0.083544 -0.060819 -0.063095 -0.610210 -0.145220 -0.090830 -0.116985 -0.062922 -0.339189 0.147065 -0.238039 -0.099236 0.329891 0.321106 0.162241 -0.760174 0.321015 -0.771988 -0.365697 -0.751539 0.361362 0.282404 0.296500 0.263299 0.249261 0.246423 0.352377 0.246595 0.251505 0.254652 0.279572 0.243651 0.247852 0.243721 0.332314 0.345705 0.248588 0.255748 0.250246
chargesum: 0.00000
title: Mulliken charges with hydrogens summed into heavy atoms:
elementType: O O O O O O O N N N N N C C C C C C C C C C C C C C C C
charge: -0.252688 -0.262335 -0.270130 -0.248145 -0.246068 -0.222662 -0.253656 -0.217921 -0.083544 -0.060819 -0.063095 0.067808 0.216142 0.191574 0.179515 0.200377 0.156495 0.147065 0.114338 -0.099236 0.329891 0.321106 0.162241 -0.007422 0.321015 -0.000913 -0.121976 0.003044
polarizability: 2.69671860e+02 -1.32968487e-01 2.48167641e+02 2.40951237e+01 -4.41580627e-01 1.69157168e+02
1716.lowfreq: -5.9465 -0.0004 -0.0003 0.0006 3.2395 6.8543 18.8879 27.1553 38.6396
frequency: 18.8647 27.1476 38.6366 40.4285 45.2304 48.3880 51.5914 56.2733 58.6089 73.2785 79.6494 94.8088 98.7047 110.9597 129.7530 133.8138 160.0764 179.9675 189.4497 216.4219 221.3277 251.0131 252.5050 264.2159 287.0794 289.4301 303.7584 313.1911 354.2839 381.1142 404.8316 444.6534 492.2234 511.1485 516.0671 531.4896 549.8587 552.2110 555.0796 559.9599 562.4628 566.2485 593.6509 610.4919 622.8474 642.5194 649.5896 664.1803 697.5661 707.2026 740.8562 761.3298 782.8930 798.0123 805.0897 835.5886 852.9249 866.3760 896.6337 905.5039 928.8594 936.6026 956.6790 960.3919 983.0402 995.2830 1003.0874 1011.8104 1015.7075 1031.4556 1040.6385 1043.0523 1044.7433 1046.1249 1061.5826 1104.1673 1123.8583 1136.9377 1175.7459 1183.6174 1194.9146 1202.0192 1210.5136 1225.9356 1245.7940 1251.7046 1262.7801 1282.9073 1298.7860 1309.9965 1317.0813 1324.2753 1334.0318 1348.6167 1362.0449 1371.0186 1378.2924 1379.9704 1382.6897 1385.7878 1387.2738 1427.7684 1443.5482 1452.0163 1452.8227 1453.0986 1454.3828 1455.0814 1456.9922 1461.6746 1537.6776 1577.8318 1631.9756 1659.5453 1662.2204 1676.1976 3003.9871 3008.4940 3009.7996 3024.4662 3026.2059 3044.1410 3061.2398 3089.8573 3098.0255 3099.5025 3101.1010 3101.9426 3142.3132 3144.3720 3145.3679 3166.4616 3210.3216 3539.4531 3694.8651
redmass: 6.0405 5.0579 5.0371 1.9438 1.6314 3.4978 2.3063 3.4902 5.3240 2.2719 3.6657 4.5738 7.3356 6.6329 1.0599 5.7332 5.6798 6.5937 6.4428 5.6472 6.0638 5.1448 8.5809 6.9345 3.4981 4.8640 7.0995 4.9582 4.7065 2.9787 3.6570 3.7957 3.0915 8.5699 1.2379 4.0256 1.0469 3.5618 3.8963 3.1751 4.0994 3.4909 5.8062 5.2936 6.3705 5.6680 5.4757 10.1177 5.4880 6.2174 6.0878 5.5466 5.0319 10.0651 4.6752 5.2209 7.2708 4.7064 4.5297 1.2788 1.4309 3.5442 4.4834 2.4841 2.1733 1.9054 2.3719 3.7543 3.1587 2.6786 3.4695 1.7544 1.6907 1.7346 3.9511 4.9197 2.5947 5.0984 3.0130 2.1714 3.4754 2.9364 2.2799 1.8838 1.2940 1.4452 2.0054 1.5975 5.1889 1.4916 1.8730 1.7071 1.3636 1.3869 2.4301 1.2781 1.3840 3.0936 1.2583 1.2654 1.3130 2.8399 1.0980 1.0569 1.0562 1.0573 1.0513 1.0530 1.0528 3.7485 8.1229 1.8780 2.7338 9.1513 9.6236 10.2576 1.0383 1.0380 1.0368 1.0804 1.0624 1.0840 1.0878 1.0883 1.0973 1.0940 1.0949 1.1074 1.1024 1.1021 1.1011 1.0921 1.1028 1.0442 1.1056
irintensity: 0.3584 0.1996 1.9102 1.1540 2.9300 1.2159 0.3784 0.4779 0.0875 1.3322 0.6486 7.3163 1.7174 5.6799 0.5396 4.8087 8.5196 3.7063 5.0175 6.7703 0.9876 4.6672 2.1444 5.8985 6.1216 7.6537 4.4345 0.2205 6.9667 5.1606 13.0942 8.4607 10.9451 4.1869 263.2505 8.0257 3.7346 9.6852 1.5513 0.6619 2.1147 8.4580 15.3825 8.8915 2.7005 19.3973 36.3624 8.9833 6.0301 17.0407 1.1854 18.3498 19.5899 10.2948 5.3582 60.0252 2.6935 7.0967 71.3414 19.3222 10.0457 97.3185 34.1193 6.0372 15.8571 76.9165 91.1694 41.6800 11.2931 12.0748 172.3386 6.1305 11.8522 35.3596 63.0053 1.0249 10.9291 46.4969 221.7002 63.9919 647.2594 50.0857 33.4577 107.5917 2.9865 30.1584 95.1995 22.4096 53.4428 9.1303 7.7354 23.6904 6.5186 0.1817 57.9287 8.9372 13.8450 5.8627 49.6801 80.6925 43.9395 68.9384 16.7794 31.1285 24.9772 16.3151 13.2905 17.2815 21.1494 19.3458 60.7858 34.1865 651.7787 174.2871 174.6171 163.4655 1.2211 1.2374 1.3746 20.4532 12.1321 18.6617 9.8400 3.6784 5.2343 5.2825 7.9473 9.4437 7.5765 7.2951 8.8128 15.1938 115.3958 129.9315 49.6591
temp: 298.150 k
press: 1.00000 atm
elementType: 8 8 8 8 8 8 8 7 7 7 7 7 6 6 6 6 6 6 6 6 6 6 6 6 6 6 6 6 1 1 1 1 1 1 1 1 1 1 1 1 1 1 1 1 1 1 1
symmnumber: 1
zpe: 928326.3 jmol-1
zpe.correction: 0.353581 hartree
zpe.thermalcorrener: 0.381169 hartree
zpe.thermalcorrenthalpy: 0.382113 hartree
zpe.thermalcorrgfe: 0.291908 hartree
zpe.sumelectzpe: -1419.372110 hartree
zpe.sumelectthermal: -1419.344522 hartree
zpe.sumelectthermalent: -1419.343578 hartree
zpe.sumelectthermalfe: -1419.433783 hartree
dipole: -4.6620 1.5838 -1.4327
dipole: 5.1278
quadrupole: -137.8230 -161.8396 -158.8028
quadrupole: 4.3120 5.7862 5.0728
quadrupole: 14.9988 -9.0178 -5.9810 4.3120 5.7862 5.0728
hfenergy: -1419.7256904 hartree
pointgroup: C01 [X(C16H19N5O7)]
dipole: 1.6758637 -0.1724969 1.109865 debye
polarizability: 245.2757505|-10.9785174|251.6760268|45.9707297|0.1791941|190.0448918 unknown
InChI: InChI=1S/C16H19N5O7/c1-7(22)25-4-10-12(26-8(2)23)13(27-9(3)24)16(28-10)21-6-20-11-14(17)18-5-19-15(11)21/h5-6,10,12-13,16H,4,17H2,1-3H3
charge 0 multiplicity 1
47 atoms
O  0.737026 0.798706 1.454799
O  0.452073 -2.177262 1.452823
O  2.342337 -1.733481 -0.602073
O  3.201718 2.418378 0.972856
O  0.411185 -3.964549 -0.053834
O  1.65406 -1.820452 -2.837569
O  1.395442 3.899469 0.842018
N  -1.319992 0.823384 0.207582
N  -2.280031 2.649826 -0.798095
N  -3.002524 -0.908757 -0.41243
N  -4.833742 0.03444 -1.758517
N  -4.937073 2.316106 -2.369448
C  0.078076 -1.240088 0.367904
C  1.3399 -0.69405 -0.347564
C  -0.442786 0.017524 1.092957
C  1.909088 0.342114 0.646902
C  2.57254 1.535147 -0.039399
C  -2.496898 0.360942 -0.398899
C  -1.248678 2.211958 -0.051361
C  -3.066926 1.503974 -1.018873
C  0.572454 -3.536908 1.107627
C  2.341593 -2.291656 -1.912264
C  -4.288567 1.297901 -1.725208
C  0.908464 -4.347998 2.336908
C  2.482222 3.56337 1.359188
C  3.246251 -3.49387 -1.95988
C  -4.174683 -0.976625 -1.114796
C  3.211003 4.287033 2.466584
H  -0.65637 -1.712764 -0.302933
H  1.032075 -0.237156 -1.307795
H  -0.981753 -0.242325 2.019326
H  2.616802 -0.146511 1.34039
H  1.844688 2.113528 -0.635176
H  3.40435 1.185383 -0.674092
H  -0.431471 2.827246 0.323714
H  1.005203 -5.408907 2.066297
H  1.850791 -3.98611 2.783149
H  0.118184 -4.228794 3.097987
H  2.672085 -4.363368 -1.589309
H  4.12285 -3.360203 -1.30686
H  3.557925 -3.690109 -2.996295
H  -4.645177 -1.962565 -1.172524
H  -5.805503 2.116262 -2.861153
H  -4.544995 3.255303 -2.353467
H  2.840362 5.319635 2.541441
H  3.019625 3.770617 3.424825
H  4.298602 4.277166 2.29264
