program: Gaussian 09
title: 000253484
version: EM64L-G09RevD.01
frameworkgroup: C1[X(C8H10ClN3O3)]
method: RPBEPBE
basis: SDD
operation: Freq
keyword: #p
keyword: freq=noraman
keyword: PBEPBE/SDD
title: #p freq=noraman PBEPBE/SDD
converged: YES YES NO NO
title: Mulliken charges:
elementType: Cl O O O N N N C C C C C C C C H H H H H H H H H H
charge: -0.056005 -0.278670 -0.264259 -0.271960 -0.197689 -0.157897 -0.410102 0.284215 0.121286 0.222557 -0.208594 -0.598231 -0.618017 0.258347 -0.676524 0.330643 0.254702 0.254697 0.271678 0.245877 0.246465 0.284309 0.370085 0.296487 0.296598
chargesum: 0.00000
title: Mulliken charges with hydrogens summed into heavy atoms:
elementType: Cl O O O N N N C C C C C C C C
charge: -0.056005 -0.278670 -0.264259 -0.271960 -0.197689 -0.157897 -0.040016 0.284215 0.121286 0.222557 0.122049 0.182846 0.158634 0.258347 -0.083439
polarizability: 1.89096464e+02 -5.57872503e+00 1.46971426e+02 1.19109629e-01 6.43633879e-02 6.31867760e+01
1716.lowfreq: -4.7398 -3.3763 -0.0026 -0.0023 -0.0014 4.9929 31.1903 59.2911 83.4290
frequency: 31.1852 59.2826 83.4247 84.1614 86.8097 91.4604 118.1010 124.6992 159.1501 201.5658 260.7865 271.1349 309.3726 352.8951 379.1737 389.4250 393.2140 433.7163 447.4163 480.0124 526.6757 571.7743 630.7860 694.6039 709.1927 729.6166 749.4286 759.1192 823.3573 908.2412 917.7580 921.2246 923.2939 992.3738 1066.3475 1088.2665 1129.3146 1131.7281 1154.4104 1162.1446 1223.4479 1246.2248 1258.9951 1268.9809 1319.9236 1352.1440 1393.9014 1420.9562 1434.2688 1436.8025 1473.1308 1476.0966 1481.0279 1491.4543 1531.9095 1565.2921 1586.7502 1632.8437 1658.7681 3002.6492 3016.3932 3066.4726 3093.9335 3109.8585 3135.6798 3144.6281 3145.6910 3193.4683 3392.0664
redmass: 7.0962 4.2578 1.1266 9.1164 2.9468 1.0836 3.9547 6.3448 9.3500 4.1900 7.8882 4.7011 2.9656 4.5647 8.4761 5.7960 9.1766 7.8547 4.0779 8.5150 5.5579 3.5222 5.3216 6.7796 10.8933 5.8089 9.8992 6.9997 1.1214 1.7034 1.3257 5.3447 3.3082 4.9473 2.3921 2.4784 1.2962 1.3117 1.1112 2.1638 1.8488 4.1938 1.3527 3.2446 2.7567 2.5888 2.3911 1.0963 1.3447 1.4317 1.0429 1.0657 1.1705 1.0430 2.4951 9.1010 7.8293 9.0656 7.8909 1.0343 1.0328 1.0567 1.1035 1.1023 1.0998 1.1028 1.1088 1.0958 1.0767
irintensity: 0.6010 0.1886 1.0801 0.6628 9.9913 1.2276 5.9469 13.7502 9.7296 2.1577 0.0047 0.0110 1.0356 15.3291 1.9615 0.1594 40.0246 49.8362 1.0936 7.5923 1.2642 0.9675 2.3421 71.5442 7.0055 6.8480 18.4252 2.8072 67.8751 19.1002 35.3965 1.0033 5.6677 7.9732 7.2448 36.6237 0.6900 0.0144 0.3774 32.9764 0.1007 12.7363 16.4337 9.5627 58.3693 34.7204 121.7270 67.4987 146.2031 157.8584 19.0407 21.6766 146.3698 19.7363 376.9027 281.7892 426.5985 179.5980 138.2136 45.2973 19.1719 4.8348 19.3224 14.1102 0.0781 0.7034 0.9342 6.4978 88.5303
temp: 298.150 k
press: 1.00000 atm
elementType: 17 8 8 8 7 7 7 6 6 6 6 6 6 6 6 1 1 1 1 1 1 1 1 1 1
symmnumber: 1
zpe: 483891.9 jmol-1
zpe.correction: 0.184305 hartree
zpe.thermalcorrener: 0.199517 hartree
zpe.thermalcorrenthalpy: 0.200461 hartree
zpe.thermalcorrgfe: 0.140281 hartree
zpe.sumelectzpe: -1159.767797 hartree
zpe.sumelectthermal: -1159.752584 hartree
zpe.sumelectthermalent: -1159.751640 hartree
zpe.sumelectthermalfe: -1159.811820 hartree
dipole: -0.3075 2.2545 0.0161
dipole: 2.2754
quadrupole: -100.4976 -95.6936 -92.9716
quadrupole: 0.7495 0.1102 -0.0069
quadrupole: -4.1100 0.6940 3.4160 0.7495 0.1102 -0.0069
hfenergy: -1159.9521013 hartree
pointgroup: C01 [X(C8H10Cl1N3O3)]
dipole: -0.1249595 0.8812478 -0.0958782 debye
dipolederiv: -0.3014365 -0.0703298 -0.0027329 -0.2861575 -0.5696289 0.0266342 0.021248 0.0409977 -0.1491923 -0.6166442 -0.1510909 -0.0021781 -0.215404 -1.1713259 0.0592086 0.0035057 0.0635365 -0.3664233 -1.4695298 -0.2548688 -0.0450343 -0.1798217 -0.5445841 0.0051136 -0.0516543 0.0000025 -0.3692177 -0.7728294 -0.2070888 -0.0042075 0.6071827 -0.8341757 0.0814119 -0.0813814 0.0299102 -0.3692785 -0.9154059 -0.3116968 -0.0163536 -0.2930937 -0.8249266 0.0389089 -0.0187642 0.0381887 -0.1959843 -1.4612065 -0.5949225 -0.0258286 0.389023 -0.6370733 0.0684339 -0.1160296 0.002847 -0.1655061 -1.5711201 -0.0778985 -0.0724104 0.4555637 -0.4745058 0.0480264 -0.1198528 0.0140612 -0.2641378 0.632127 0.4415956 -0.0015712 0.1144376 -0.611967 0.0621388 0.0268985 0.0824081 -0.0061643 0.9977818 0.0363994 0.044488 0.3224979 1.4048345 -0.0850863 0.0188597 -0.1033342 0.2397429 1.9110433 0.2778432 0.075542 -0.1980307 1.0069364 -0.0787375 0.1186371 -0.0500647 0.281323 0.6898848 0.6674346 -0.0141134 0.1269642 0.3077881 -0.0252275 0.0354282 0.0102017 -0.0562463 0.2142696 -0.1404697 0.0138662 -0.2184094 0.211575 -0.0150184 0.0208621 -0.0102365 0.1947443 0.0328059 0.1599028 -0.0277601 0.1514511 0.5699132 -0.0252827 -0.0273988 -0.0224922 0.2163801 1.6004665 0.1797058 0.0659172 -1.0806783 0.8056944 -0.1210567 0.1873432 -0.0425583 0.2023183 -0.0439248 -0.0717128 -0.0047688 0.2757702 0.736881 -0.0461508 -0.0442181 -0.0682232 0.1548207 0.1736209 0.0411523 -0.0048871 0.0451373 0.1062597 0.0100852 -0.0051834 0.0095629 0.188061 0.0231325 0.0456673 -0.0721521 -0.0069729 0.0870905 -0.0673783 -0.0765507 -0.0088495 -0.0347973 0.0045054 0.0588487 0.0682042 0.0017402 0.0969637 0.0435663 0.0830794 -0.0080407 -0.0273788 0.1428052 -0.1248668 0.0126919 0.0063132 0.0159892 0.0112333 0.0005995 0.0028432 0.1295875 0.0952769 0.0849841 0.0927934 -0.0006744 -0.0440064 -0.0385591 0.0587926 -0.0937618 -0.0207004 0.11596 0.0515269 -0.0818724 -0.0165637 -0.021486 0.0355477 -0.0340646 0.1029371 -0.0690138 0.0005466 -0.094421 -0.0026376 0.0422834 0.1619034 0.0014426 -0.0139351 -0.0075838 0.13416 0.4170023 0.0863954 -0.0015964 -0.0206145 0.2685067 0.0012131 0.0076245 0.0078126 0.2970476 0.058101 -0.0221737 -0.0426585 -0.0238535 -0.016825 0.0464903 -0.0825883 0.0223084 0.012217 0.0427678 -0.009916 0.0492601 0.00191 -0.0298308 -0.0369576 0.0887427 -0.0124729 0.0436385 unknown
polarizability: 182.5953634|16.3803591|152.4330972|5.7471499|-7.3589831|64.2262052 unknown
InChI: InChI=1S/C8H10ClN3O3/c1-11-4-5(10-6(13)3-9)7(14)12(2)8(11)15/h4,10H,3H2,1-2H3
charge 0 multiplicity 1
25 atoms
Cl -4.055026 -2.448886 -0.009158
O  0.370633 -2.49381 0.233468
O  3.723436 0.803699 0.143767
O  -2.729823 1.390624 -0.308333
N  2.057229 -0.843997 0.189745
N  1.472416 1.460642 -0.054167
N  -1.615315 -0.654232 -0.054159
C  -0.282029 -0.193518 -0.01431
C  0.705399 -1.269575 0.143774
C  2.49881 0.498958 0.095795
C  0.123857 1.121441 -0.107349
C  3.117547 -1.867027 0.349731
C  1.863303 2.884868 -0.159717
C  -2.738433 0.12156 -0.192258
C  -4.10015 -0.571439 -0.211826
H  -0.598467 1.930662 -0.224069
H  3.697224 -1.665154 1.264879
H  3.804777 -1.832244 -0.510997
H  2.623206 -2.846935 0.411641
H  1.402854 3.466724 0.656787
H  1.544123 3.296627 -1.132426
H  2.958453 2.941606 -0.079356
H  -1.709334 -1.678983 0.034455
H  -4.596526 -0.376897 -1.174092
H  -4.717568 -0.185916 0.612775
