program: Gaussian 09
title: 000250660
version: EM64L-G09RevD.01
frameworkgroup: C1[X(C14H8N2O)]
method: RPBEPBE
basis: SDD
operation: Freq
keyword: #p
keyword: freq=noraman
keyword: PBEPBE/SDD
title: #p freq=noraman PBEPBE/SDD
converged: NO NO NO NO
title: Mulliken charges:
elementType: O N N C C C C C C C C C C C C C C H H H H H H H H
charge: -0.178110 -0.356683 0.019088 -0.016592 0.290117 0.367103 0.149554 0.034319 0.017339 -0.386273 -0.374190 -0.364665 -0.338733 -0.215931 -0.219694 -0.201294 -0.228312 0.268427 0.272523 0.267103 0.257458 0.237190 0.238438 0.229830 0.231988
chargesum: 0.00000
title: Mulliken charges with hydrogens summed into heavy atoms:
elementType: O N N C C C C C C C C C C C C C C
charge: -0.178110 -0.356683 0.019088 -0.016592 0.290117 0.367103 0.149554 0.034319 0.017339 -0.117847 -0.101668 -0.097563 -0.081274 0.021259 0.018744 0.028537 0.003676
polarizability: 3.13086098e+02 1.90939701e+00 1.72113163e+02 8.21036777e-03 8.80139147e-03 6.15412821e+01
1716.lowfreq: -0.0009 -0.0008 -0.0005 1.2059 7.2702 12.1672 67.7759 109.1755 145.2543
frequency: 67.7543 109.1678 145.2401 147.9037 197.5349 245.4807 275.3159 331.9857 345.9215 412.4913 416.1044 437.1206 503.6367 533.3645 554.7505 578.0055 599.8186 660.2234 663.0331 695.7569 700.2565 716.9765 761.3332 774.3776 782.8732 794.6064 803.1153 855.6561 877.9313 902.5471 912.5098 950.8975 970.5310 986.2320 1002.6306 1004.5027 1010.4890 1050.0488 1072.0544 1108.2992 1128.8458 1158.8358 1163.8970 1178.7862 1194.5282 1245.0521 1282.1724 1297.9758 1337.6529 1391.5286 1407.0639 1433.8653 1439.4407 1452.6333 1467.0004 1545.1620 1587.8168 1609.1940 1620.9548 1630.9943 1674.0857 3136.4886 3138.1036 3150.5620 3152.7702 3163.1720 3168.6007 3173.6301 3176.5731
redmass: 5.7274 4.9069 5.4564 5.4757 5.5732 8.0637 6.9288 5.1419 7.2434 5.6763 3.1562 3.3119 4.2200 7.8046 8.3510 3.7352 8.3010 7.3298 5.1821 7.1393 7.3834 3.1112 1.7874 2.2164 2.8704 2.1169 6.1167 7.2799 1.4369 1.4235 8.6166 1.3867 1.4117 1.3143 1.3473 2.1489 2.3174 4.9725 2.8623 2.1962 2.2018 1.3982 1.8178 1.2412 2.4401 3.5291 1.5806 1.8473 4.5761 3.1975 5.6864 3.3753 2.8836 2.4733 2.9944 9.4680 6.7572 7.4650 7.8494 8.7069 12.3346 1.0862 1.0863 1.0909 1.0910 1.0955 1.0959 1.1001 1.0993
irintensity: 3.0257 2.1727 0.4786 1.6941 0.2234 2.4504 2.9729 0.0029 1.1885 3.6459 0.8696 6.4331 8.7064 5.2249 0.2043 0.0930 2.6667 1.4863 5.5161 1.0330 4.6422 20.7217 97.6245 58.5997 8.6430 14.4981 0.8126 33.1826 0.2067 0.1164 29.6503 5.4205 2.7214 0.0420 0.0184 5.0565 11.2647 40.6428 14.2396 3.8367 37.3186 6.4917 22.6327 3.9262 4.0298 29.3135 10.1459 28.9865 126.5848 14.1759 11.3973 60.9327 10.3756 27.3157 21.3224 22.6082 8.4168 0.9513 56.5532 78.7129 198.6141 3.3680 1.9969 5.9456 14.9481 9.6497 10.7914 21.2622 15.0814
temp: 298.150 k
press: 1.00000 atm
elementType: 8 7 7 6 6 6 6 6 6 6 6 6 6 6 6 6 6 1 1 1 1 1 1 1 1
symmnumber: 1
zpe: 481292.7 jmol-1
zpe.correction: 0.183315 hartree
zpe.thermalcorrener: 0.194778 hartree
zpe.thermalcorrenthalpy: 0.195723 hartree
zpe.thermalcorrgfe: 0.145691 hartree
zpe.sumelectzpe: -721.913561 hartree
zpe.sumelectthermal: -721.902098 hartree
zpe.sumelectthermalent: -721.901154 hartree
zpe.sumelectthermalfe: -721.951185 hartree
dipole: 1.4221 -0.9267 0.0001
dipole: 1.6974
quadrupole: -68.7086 -100.7968 -101.3655
quadrupole: -3.9487 0.0010 -0.0002
quadrupole: 21.5817 -10.5065 -11.0752 -3.9487 0.0010 -0.0002
hfenergy: -722.0968762 hartree
pointgroup: C01 [X(C14H8N2O1)]
dipole: -0.5594491 -0.3646413 -0.0000267 debye
dipolederiv: -0.4698018 -0.1409877 -0.0000275 0.2985334 -1.1413586 -0.0001304 -0.0000932 0.0001938 -0.3206005 -1.3194501 0.3561557 -0.0000224 0.5500826 -0.8888168 0.0000753 0.0000769 -0.0000025 -0.0339065 -0.2828749 0.2659469 -0.0000129 0.1494919 -0.3423804 0.0000007 -0.000042 0.0000392 -0.2353007 0.0334007 -0.0846518 0.0000423 -0.0484997 0.6959819 -0.0000616 -0.0000521 -0.0000709 0.0689132 0.3989296 0.0643083 -0.0000055 0.003143 0.02434 0.0000126 -0.0000084 -0.0000156 0.0110544 0.6074105 -0.1237412 -0.0000119 -0.0829122 -0.0989352 -0.0000039 -0.0000495 0.0000091 0.1022411 -0.3878989 -0.279446 0.0000142 -0.0374966 -0.2139969 0.0000038 -0.0000938 0.0000144 -0.025917 1.4216755 -0.0727734 0.0000181 -0.5859432 1.6034719 0.0001421 0.000186 -0.0001286 0.2538726 0.1328763 -0.1119244 0.0000008 0.1482339 -0.0761437 -0.0000045 0.0000575 -0.0000005 0.007625 -0.3617995 -0.0960675 -0.0000152 -0.0582824 0.1156671 -0.0000044 0.0000018 -0.0000053 -0.1189827 -0.2134308 0.1005714 0. -0.001456 0.0737527 -0.0000223 -0.0000105 -0.0000228 -0.1631921 -0.0139694 0.0973696 0.0000057 -0.1764475 0.1375967 -0.0000044 -0.0000312 -0.0000029 -0.0986037 0.1034095 0.0930208 0.0000085 -0.1116617 0.1535371 -0.0000413 0.0000292 -0.000043 -0.1399205 0.2046859 0.0940062 0.0000268 0.0464983 0.0602638 -0.0000046 0.0000178 0.0000011 -0.1291446 0.0562493 -0.0773809 0.000026 0.0215866 -0.1399246 -0.0000072 0.0000438 -0.0000136 -0.1600195 0.0143163 -0.0137819 -0.0000086 0.0659759 0.1540853 -0.0000408 -0.0000096 -0.0000479 -0.1593752 0.0412028 -0.0979227 0.0000147 -0.1954027 -0.1711287 -0.0000209 0.0000378 0.0000061 -0.1720638 0.0883507 0.0476898 -0.0000058 0.014419 -0.0274664 0.0000015 0.0000262 0. 0.161342 0.0835532 0.0518105 -0.0000044 0.002795 -0.0124335 0.0000301 -0.0000002 0.0000235 0.1802715 0.0991189 0.0009318 -0.0000042 0.0538814 -0.023565 0.0000017 -0.0000188 -0.000009 0.1588155 0.0941895 0.0065441 -0.0000034 0.0509778 -0.0475188 0.0000346 -0.0000199 0.0000273 0.1668035 -0.0408849 -0.0940955 -0.0000118 -0.1150795 0.0081447 -0.0000053 -0.000029 -0.0000063 0.1561387 -0.1091589 0.0457818 -0.0000219 0.055052 0.076911 0.0000083 -0.0000203 0.0000173 0.1634985 -0.0511409 -0.095149 0.0000128 -0.1114713 0.0105336 0.0000249 0.0000164 0.0000216 0.1614636 -0.1289589 0.0637851 -0.0000145 0.063982 0.0693828 0.0000161 -0.0000146 0.0000154 0.164987 unknown
polarizability: 313.0864526|-1.8962771|172.1128087|0.0082112|-0.0088006|61.5412821 unknown
InChI: InChI=1S/C14H8N2O/c17-14-10-6-2-1-5-9(10)13-15-11-7-3-4-8-12(11)16(13)14/h1-8H
charge 0 multiplicity 1
25 atoms
O  -0.540797 2.746027 0.000177
N  0.335321 0.514794 0.000278
N  0.755903 -1.75001 0.000548
C  -0.189838 -0.813866 0.000332
C  -1.650752 -0.706327 0.0003
C  1.735149 0.407284 0.000264
C  -1.967863 0.688619 0.000271
C  -0.702187 1.506504 0.00048
C  1.982158 -1.015256 0.000461
C  -2.668346 -1.674655 0.00025
C  2.773592 1.353018 0.0001
C  -3.296829 1.134433 0.000121
C  3.30398 -1.502498 0.000557
C  -4.015893 -1.224381 0.000129
C  -4.328976 0.1576 0.000055
C  4.094752 0.842434 0.00019
C  4.356439 -0.557119 0.000418
H  -2.42898 -2.742334 0.00027
H  2.571239 2.427842 -0.000061
H  -3.525622 2.20538 0.000113
H  3.494723 -2.57992 0.000732
H  -4.826339 -1.961395 0.000073
H  -5.376346 0.477699 -0.000037
H  4.936989 1.543116 0.000088
H  5.394722 -0.906088 0.00049
