program: Gaussian 09
title: 000250657
version: EM64L-G09RevD.01
frameworkgroup: C1[X(C10H13N3O2)]
method: RPBEPBE
basis: SDD
operation: Freq
keyword: #p
keyword: freq=noraman
keyword: PBEPBE/SDD
title: #p freq=noraman PBEPBE/SDD
converged: YES YES NO NO
title: Mulliken charges:
elementType: O O N N N C C C C C C C C C C H H H H H H H H H H H H H
charge: -0.304907 -0.265571 -0.487915 -0.438210 -0.424145 0.496164 0.502235 -0.460753 -0.327760 -0.335445 -0.457516 0.303707 0.206324 -0.800470 -0.603743 0.213790 0.308509 0.307849 0.215917 0.286694 0.307737 0.289812 0.235470 0.267536 0.235590 0.223635 0.223982 0.281485
chargesum: 0.00000
title: Mulliken charges with hydrogens summed into heavy atoms:
elementType: O O N N N C C C C C C C C C C
charge: -0.304907 -0.265571 -0.201222 -0.130473 -0.134333 0.496164 0.502235 -0.246963 -0.019251 -0.027595 -0.241599 0.303707 0.206324 -0.061875 0.125359
polarizability: 2.59597293e+02 4.01301785e+00 1.32548925e+02 -4.29045775e-02 2.28877688e-02 6.57936018e+01
1716.lowfreq: -71.1200 -0.0007 -0.0004 0.0005 4.1103 7.3139 21.2246 34.0054 47.8821
frequency: -71.0711 33.9952 47.8725 75.3988 85.9156 91.4501 112.1506 141.9063 160.6428 189.7001 242.0126 280.4189 344.5215 350.1997 377.9398 392.4992 404.0383 412.8009 529.1268 530.9053 581.1724 588.4430 629.6394 638.1592 645.4125 702.8291 716.8335 726.2701 799.5529 834.2721 846.7272 849.9859 929.1232 938.2899 970.5356 981.3571 985.2354 1006.2055 1029.2011 1109.0976 1126.6617 1127.7125 1133.6424 1191.6706 1218.8871 1221.0736 1252.8246 1277.5180 1322.1367 1357.8792 1374.5335 1417.5852 1423.4260 1448.5294 1457.8318 1469.1882 1485.4363 1487.9424 1509.6838 1518.9036 1525.7459 1600.6473 1627.8008 1633.0768 1647.0338 2973.9135 2986.3331 3050.5625 3071.2667 3107.9243 3109.4534 3112.2905 3135.0030 3191.7904 3194.2469 3521.9156 3525.5453 3559.7653
redmass: 1.0701 4.5065 3.8555 4.0143 3.7717 4.4738 1.1933 3.0375 5.4684 3.5987 5.1030 4.4232 5.5653 1.8726 4.9362 4.4066 2.1479 3.0499 2.3903 4.4461 2.9984 1.2213 6.9397 1.1791 5.2997 10.8717 4.7246 3.7246 4.6790 1.2946 5.5157 1.6539 6.2531 4.3455 1.3103 1.3183 1.7264 2.5418 1.6507 3.9079 1.4391 1.2755 1.5230 1.1281 1.9626 3.1367 1.8049 1.8807 1.8203 4.1120 1.2456 3.6958 1.2185 1.1669 1.3109 1.0470 1.8257 1.0488 2.2994 1.6607 2.1096 5.4993 5.0500 5.9952 4.3461 1.0354 1.0383 1.1028 1.0984 1.0973 1.0904 1.0909 1.0978 1.0940 1.0947 1.0764 1.0761 1.0772
irintensity: 0.0017 0.1349 24.8494 3.4649 0.1357 8.3788 0.9444 3.4225 1.9279 0.6653 1.4120 0.5623 33.7878 9.9682 3.9498 1.3611 16.6106 0.4389 76.8728 7.0470 0.0309 159.0033 0.3274 66.1817 0.6370 12.3183 5.4807 0.0680 0.0916 2.3691 0.1952 121.7855 11.5059 4.5263 0.0117 5.0157 28.0876 4.0543 7.8888 16.8167 31.9495 0.0847 30.0497 0.1335 362.1619 104.7891 50.2716 2.8238 1.7964 422.6848 63.4744 50.0345 22.9006 70.5885 196.5031 19.3718 8.2116 15.6214 148.7298 11.3949 1095.2110 0.8550 185.6352 2.8736 132.2052 117.7856 11.1686 44.3617 16.8975 1.4858 45.0395 0.7881 8.0782 11.4738 0.9354 12.0347 4.6562 24.4100
temp: 298.150 k
press: 1.00000 atm
elementType: 8 8 7 7 7 6 6 6 6 6 6 6 6 6 6 1 1 1 1 1 1 1 1 1 1 1 1 1
symmnumber: 1
zpe: 584430.9 jmol-1
zpe.correction: 0.222598 hartree
zpe.thermalcorrener: 0.237233 hartree
zpe.thermalcorrenthalpy: 0.238178 hartree
zpe.thermalcorrgfe: 0.179808 hartree
zpe.sumelectzpe: -702.498263 hartree
zpe.sumelectthermal: -702.483627 hartree
zpe.sumelectthermalent: -702.482683 hartree
zpe.sumelectthermalfe: -702.541053 hartree
dipole: 1.8613 0.3208 0.0012
dipole: 1.8887
quadrupole: -68.1043 -83.2212 -92.8231
quadrupole: 32.4275 -0.0546 0.0127
quadrupole: 13.2785 -1.8383 -11.4402 32.4275 -0.0546 0.0127
hfenergy: -702.7208607 hartree
pointgroup: C01 [X(C10H13N3O2)]
dipole: 0.729989 0.1388383 -0.0042669 debye
polarizability: 259.4198288|6.2063598|132.6594782|-0.3279893|-2.114053|65.8605124 unknown
InChI: InChI=1S/C10H13N3O2/c1-7(14)12-8-3-5-9(6-4-8)13-10(15)11-2/h3-6,11-13H,1-2H3
charge 0 multiplicity 1
28 atoms
O  3.46062 -1.298366 0.038526
O  -4.305803 1.326117 -0.045743
N  2.330382 0.777584 -0.030733
N  -3.164415 -0.725583 0.020107
N  4.671677 0.701416 -0.027435
C  0.971119 0.359495 -0.016809
C  -1.799409 -0.311378 0.005402
C  -0.028694 1.36828 -0.047004
C  0.569477 -1.00268 0.024817
C  -1.399098 1.050362 -0.036532
C  -0.800773 -1.319794 0.035319
C  3.480849 -0.030354 -0.0036
C  -4.31785 0.05958 -0.003555
C  -5.615322 -0.752046 0.026705
C  5.973146 0.028393 -0.006269
H  0.266017 2.425891 -0.079483
H  1.330625 -1.784141 0.048142
H  -2.159468 1.832481 -0.059879
H  -1.095828 -2.377322 0.06782
H  2.465732 1.790138 -0.064182
H  -3.309331 -1.737748 0.053542
H  4.653126 1.720883 -0.062118
H  -5.689162 -1.427758 -0.845759
H  -6.463671 -0.053275 0.004066
H  -5.685778 -1.365623 0.944209
H  6.567333 0.322109 0.87938
H  6.557863 0.244641 -0.920228
H  5.780036 -1.055299 0.040991
