program: Gaussian 09
title: 000250652
version: EM64L-G09RevD.01
frameworkgroup: C1[X(C8H10ClN3S)]
method: RPBEPBE
basis: SDD
operation: Freq
keyword: #p
keyword: freq=noraman
keyword: PBEPBE/SDD
title: #p freq=noraman PBEPBE/SDD
converged: NO YES NO NO
title: Mulliken charges:
elementType: Cl S N N N C C C C C C C C H H H H H H H H H H
charge: -0.038797 -0.008075 -0.200028 -0.188924 0.067282 -0.405680 -0.402239 0.520556 -0.348891 -0.320424 -0.394158 -0.576948 -0.301663 0.250576 0.243004 0.278716 0.282002 0.251329 0.248218 0.244235 0.270106 0.285712 0.244092
chargesum: 0.00000
title: Mulliken charges with hydrogens summed into heavy atoms:
elementType: Cl S N N N C C C C C C C C
charge: -0.038797 -0.008075 -0.200028 -0.188924 0.067282 0.087900 0.158479 0.520556 0.150656 -0.076189 -0.394158 -0.021130 -0.057571
polarizability: 2.10679115e+02 1.01600754e+01 1.34688144e+02 1.46918211e+01 3.45616750e+00 7.04443695e+01
1716.lowfreq: -9.6554 -0.0027 -0.0020 -0.0010 2.8070 5.9049 31.4165 36.4910 47.2869
frequency: 31.3761 36.4781 47.2717 80.9288 107.6664 181.4832 201.2079 210.0226 223.2181 283.8091 326.4821 434.8789 445.5369 491.6672 535.7760 619.1894 624.8733 655.5069 711.8688 721.2060 762.2165 777.4261 820.0770 839.1915 866.2282 934.5826 966.3257 983.1706 1016.1752 1038.0050 1048.5339 1101.7134 1122.6953 1155.4846 1185.0009 1194.8483 1207.6101 1212.0919 1254.4577 1259.6111 1297.9310 1300.8442 1315.6424 1353.4623 1359.2729 1393.7247 1424.4613 1456.8890 1473.5243 1481.7840 1500.2991 1524.6498 1618.5208 2990.3003 3013.1131 3031.0923 3040.3067 3062.2682 3074.1895 3089.1105 3125.0190 3147.0537 3197.5103
redmass: 7.8168 7.2196 2.5252 2.2813 3.5760 6.2043 10.2987 3.7826 4.7178 4.0484 4.4497 11.1353 3.5855 4.3894 7.9131 5.5785 6.4665 6.8595 5.2397 4.5730 1.4084 1.1557 4.7027 1.2491 6.4099 1.4195 2.1926 3.0632 2.8093 4.3046 1.7940 1.6349 2.2084 3.4445 1.2049 1.8822 1.0885 4.4130 2.2328 1.1943 1.6209 1.3245 1.6010 1.7953 1.7277 1.7788 3.2199 1.0994 1.1462 1.2195 1.1125 3.3646 6.7483 1.0585 1.0603 1.0622 1.1055 1.0564 1.1050 1.1063 1.0910 1.1122 1.0953
irintensity: 3.8737 3.7682 1.5258 1.5755 0.1773 0.1981 3.7726 5.3637 3.4555 11.3645 5.1735 6.7770 1.5591 2.5189 2.6584 25.9741 1.3341 20.6955 28.1771 2.9199 62.7708 8.4695 13.4688 1.6740 9.8713 0.7149 10.3770 13.9628 2.7575 7.2964 24.0881 0.6491 43.4733 59.6259 2.0288 7.6432 0.2688 146.5069 1.0102 16.2520 59.6153 11.3799 5.3630 157.8582 58.9603 35.7332 17.4117 4.6801 33.5222 48.6389 24.9282 555.8932 406.6533 51.7744 21.6395 6.7202 15.2385 17.1172 5.0531 11.4150 24.5658 9.8941 3.9166
temp: 298.150 k
press: 1.00000 atm
elementType: 17 16 7 7 7 6 6 6 6 6 6 6 6 1 1 1 1 1 1 1 1 1 1
symmnumber: 1
zpe: 460483.7 jmol-1
zpe.correction: 0.175389 hartree
zpe.thermalcorrener: 0.187813 hartree
zpe.thermalcorrenthalpy: 0.188757 hartree
zpe.thermalcorrgfe: 0.133744 hartree
zpe.sumelectzpe: -1332.253193 hartree
zpe.sumelectthermal: -1332.240769 hartree
zpe.sumelectthermalent: -1332.239825 hartree
zpe.sumelectthermalfe: -1332.294838 hartree
dipole: 7.0951 -2.9726 1.1126
dipole: 7.7727
quadrupole: -134.7703 -82.0286 -90.3730
quadrupole: 2.5622 -1.9698 0.1891
quadrupole: -32.3796 20.3620 12.0176 2.5622 -1.9698 0.1891
hfenergy: -1332.4285822 hartree
pointgroup: C01 [X(C8H10Cl1N3S1)]
dipole: -2.9072294 0.8740937 0.3680831 debye
dipolederiv: -0.7425109 -0.1131835 -0.0288673 -0.1852777 -0.1869633 -0.0115803 0.0217816 0.0102052 -0.1839891 -0.7688832 -0.210354 0.0779183 -0.4813798 -0.5260404 0.083496 0.1118087 0.052943 -0.2749902 -1.5147793 0.2128269 -0.0203442 0.6002839 -0.6631393 -0.0720069 -0.0949692 -0.0528312 -0.3364087 -1.3952752 -0.233979 0.1623727 0.0587778 -0.4412278 0.0219963 0.1988807 0.0673099 -0.0661604 -0.9441197 -0.1104779 0.0919797 -0.9002633 -0.9270608 0.1765754 0.1807896 0.0815794 -0.225572 -0.0694286 0.0338194 0.0499389 -0.1070561 0.5625872 0.0485411 0.0573468 0.0041369 0.3133049 0.173473 0.0117964 0.0060807 -0.0515935 0.2402615 0.0053832 0.0023006 -0.0146831 0.2254414 1.4121656 -0.2366496 -0.0616296 -1.273029 0.9066931 0.0329735 -0.0521908 -0.0371464 0.2030744 0.7748113 0.0301418 -0.0072548 0.1877315 0.1091089 -0.0048127 0.12418 0.0942279 0.2307835 -0.8795838 0.0695289 0.0647594 0.9266556 -0.5791596 -0.0598322 -0.0052072 0.0144373 -0.2932068 1.4575914 0.3833811 -0.2277403 0.8831166 0.8995224 -0.2004496 -0.297188 -0.1409684 -0.0381961 0.8158148 0.1667813 -0.0194789 0.1912454 0.2117262 -0.0117838 -0.0737625 -0.062937 0.1025712 1.4591395 0.0184586 -0.1716031 0.0304283 0.499612 -0.0532173 -0.1958445 -0.0446411 0.0347643 0.0605161 0.0325547 0.0476695 0.0618111 -0.0466908 -0.0634976 0.0757273 -0.1289751 -0.0695403 0.033033 0.069951 -0.0745156 0.0882509 -0.0248358 0.0346756 -0.1027228 0.1054556 -0.0337591 0.0637045 -0.0239106 0.0347067 0.025148 0.0459971 0.0225583 0.0072685 0.055246 -0.0318012 0.045124 -0.0575108 -0.0505412 0.009354 0.0378838 -0.0365318 -0.025092 -0.0466165 0.0143473 0.0322431 0.0126694 -0.0314188 -0.0769888 -0.019356 0.1085873 -0.0301331 0.047517 0.0182439 -0.0276124 0.0338169 0.0333718 0.0758806 -0.0097977 -0.0984379 0.0156078 -0.0715524 0.0396814 -0.0379619 -0.0805382 0.0341233 -0.0591607 0.0736441 0.012125 0.0355605 0.019228 0.1963696 -0.0090732 -0.0476806 0.0196636 -0.0133649 -0.0329499 0.1086195 -0.003151 0.0652812 0.0148842 -0.0323301 0.0382548 0.0682352 0.012775 -0.004945 -0.0668147 0.0436175 -0.0358054 0.0430909 0.0939421 0.0003031 0.002574 -0.003345 -0.1248699 0.0234336 0.0053917 0.0185891 0.1170668 unknown
polarizability: 207.9849351|17.726865|137.3615893|-12.9028096|-7.011405|70.4651038 unknown
InChI: InChI=1S/C8H10ClN3S/c9-2-4-11-5-6-12-7(11)1-3-10-8(12)13/h1,3H,2,4-6H2
charge 0 multiplicity 1
23 atoms
Cl -4.944053 -0.73087 -0.366617
S  3.776382 1.030202 -0.395942
N  -1.093895 0.607766 0.328182
N  1.143146 0.534105 0.024815
N  2.550938 -1.401014 -0.008523
C  -0.704796 2.040078 0.19426
C  0.835727 1.984363 -0.05994
C  0.001832 -0.221971 0.238645
C  -2.465698 0.158641 0.568598
C  0.11093 -1.61723 0.333182
C  2.450489 -0.017612 -0.113822
C  -3.185553 -0.177946 -0.752822
C  1.435357 -2.132278 0.2030
H  -0.949904 2.589264 1.122709
H  -1.240858 2.51933 -0.64491
H  1.134725 2.363669 -1.051564
H  1.428894 2.529602 0.692463
H  -2.46129 -0.729058 1.226758
H  -3.01804 0.954497 1.099392
H  -0.749033 -2.267213 0.496923
H  -3.278991 0.695967 -1.414264
H  -2.709439 -1.01527 -1.283612
H  1.593428 -3.215523 0.274685
