program: Gaussian 09
title: 000253447
version: EM64L-G09RevD.01
frameworkgroup: C1[X(C16H18N2O3)]
method: RPBEPBE
basis: SDD
operation: Freq
keyword: #p
keyword: freq=noraman
keyword: PBEPBE/SDD
title: #p freq=noraman PBEPBE/SDD
converged: YES YES NO NO
title: Mulliken charges:
elementType: O O O N N C C C C C C C C C C C C C C C C H H H H H H H H H H H H H H H H H H
charge: -0.244670 -0.202702 -0.224542 -0.113040 0.006638 0.348047 0.089414 0.030491 0.436683 0.136565 -0.324501 -0.360536 -0.425500 -0.368125 -0.379734 -0.806349 0.000573 -0.223570 -0.224867 -0.674976 -0.676468 0.235550 0.270559 0.233033 0.233319 0.284216 0.239653 0.225380 0.230488 0.222261 0.227483 0.222251 0.220272 0.209399 0.235094 0.234549 0.207232 0.234541 0.235889
chargesum: 0.00000
title: Mulliken charges with hydrogens summed into heavy atoms:
elementType: O O O N N C C C C C C C C C C C C C C C C
charge: -0.244670 -0.202702 -0.224542 -0.113040 0.006638 0.348047 0.089414 0.030491 0.436683 0.136565 -0.088950 -0.089977 -0.192468 -0.134807 -0.095517 -0.110828 0.000573 0.226174 0.217656 0.004066 0.001194
polarizability: 3.08852243e+02 -1.09897032e+01 1.92463415e+02 1.01325104e+01 1.71906718e+01 1.36556090e+02
1716.lowfreq: -4.2126 -2.8005 -0.0004 0.0002 0.0006 3.8497 7.0072 21.7919 32.2193
frequency: 6.0115 21.7447 32.1825 45.7032 62.9135 64.5403 82.8306 88.0021 98.0236 117.2952 130.3058 144.6938 198.6827 214.9383 219.5938 237.8911 247.5049 258.7952 283.4164 304.4848 340.3372 344.3798 370.3944 405.4918 431.1817 455.4430 472.5968 499.0243 551.4118 599.9448 605.3513 633.9976 668.2080 698.5927 712.2518 716.3440 748.9187 784.6028 789.1889 802.7569 804.5055 838.6675 843.7975 858.6291 888.6440 899.3754 943.7208 968.4987 979.2835 985.9539 991.5030 1013.4678 1018.3505 1029.0634 1046.5321 1108.8783 1114.8230 1123.3938 1131.8220 1133.3669 1134.6635 1189.4281 1224.1344 1225.8876 1245.2554 1248.1273 1253.4626 1275.8824 1301.5503 1307.9845 1333.5243 1338.3745 1371.8887 1385.8099 1396.3156 1398.0875 1402.0213 1408.9045 1412.3760 1460.7032 1461.0833 1468.3161 1470.4033 1471.6281 1472.2232 1482.0836 1487.3703 1492.5943 1502.5024 1523.7353 1544.8432 1580.6447 1619.4789 2976.2070 2996.9675 2997.3349 3004.2631 3009.3600 3056.1743 3064.1780 3069.3632 3086.4066 3094.0362 3094.7870 3109.9936 3110.2581 3122.4646 3125.6124 3150.7410 3158.4786 3158.5771
redmass: 1.0203 4.3503 4.3059 4.0666 3.9771 2.1682 2.2975 3.4159 3.0862 4.4190 3.0309 3.9905 4.6518 4.4346 3.9924 1.4571 1.4747 3.7161 4.7532 3.1754 4.2036 3.6392 5.1367 2.8774 4.6805 3.9062 4.5397 3.6462 6.7097 5.7604 7.2769 6.9254 7.2825 5.6207 5.8297 6.3188 3.1846 6.1737 5.1736 1.0994 1.0968 2.6767 1.8236 1.3726 4.8277 5.7709 1.5166 1.3581 3.6007 1.5131 1.4614 2.7718 2.3818 2.7218 1.5836 2.3869 2.2978 1.3301 4.0797 1.5162 1.4565 1.1580 4.3693 2.9831 1.1434 1.1421 3.9740 3.3152 3.6204 1.3863 1.4487 2.1092 4.5142 2.4032 1.2400 1.4066 1.3242 2.8544 2.8123 1.0398 1.0399 1.0900 1.1790 1.0925 1.1181 1.5852 1.0787 1.7947 2.7209 8.6800 6.7991 6.5718 6.3403 1.0380 1.0362 1.0366 1.0568 1.0579 1.0958 1.1070 1.1068 1.0995 1.0986 1.0985 1.1024 1.1022 1.0882 1.0889 1.0953 1.0935 1.0954
irintensity: 0.5624 0.3851 0.5201 0.2686 0.2792 0.5605 0.5022 0.1630 0.8418 1.5086 8.3507 1.1322 6.8311 0.3934 0.6781 2.0607 2.7231 9.3498 0.4486 3.0460 2.7682 0.8743 2.1832 0.4909 7.4091 1.6190 1.9742 14.5807 2.8996 31.6633 0.3336 0.4245 16.3857 1.3629 2.5265 2.5307 13.1093 32.3080 8.0648 0.4272 6.7220 6.7059 13.2635 13.1574 89.7407 40.5742 23.4459 0.7757 22.1979 4.8786 4.5094 2.0155 60.8032 106.6404 21.0484 8.6123 1.7484 27.6868 63.1827 6.3518 9.6417 91.1257 52.9356 96.7519 0.1969 0.0418 178.3181 126.7987 445.4146 90.5453 163.8480 24.2959 7.8254 39.6066 27.1553 161.7834 10.1825 61.2393 73.0473 9.1360 15.8905 5.7920 47.8349 14.9566 23.1678 67.3392 8.2531 78.7058 2.0635 342.0968 471.8574 20.3710 64.0070 29.6115 28.3191 15.5855 16.5736 26.7437 18.8827 12.2614 8.8313 16.9690 23.2740 31.8452 15.1674 57.9563 12.7358 21.0599 19.2774 1.0262 5.1783
temp: 298.150 k
press: 1.00000 atm
elementType: 8 8 8 7 7 6 6 6 6 6 6 6 6 6 6 6 6 6 6 6 6 1 1 1 1 1 1 1 1 1 1 1 1 1 1 1 1 1 1
symmnumber: 1
zpe: 810402.6 jmol-1
zpe.correction: 0.308666 hartree
zpe.thermalcorrener: 0.329860 hartree
zpe.thermalcorrenthalpy: 0.330804 hartree
zpe.thermalcorrgfe: 0.254498 hartree
zpe.sumelectzpe: -954.133231 hartree
zpe.sumelectthermal: -954.112037 hartree
zpe.sumelectthermalent: -954.111092 hartree
zpe.sumelectthermalfe: -954.187399 hartree
dipole: -1.1641 7.0508 1.0636
dipole: 7.2250
quadrupole: -105.5292 -127.6687 -121.9074
quadrupole: 8.7539 -4.4637 -1.7378
quadrupole: 12.8393 -9.3003 -3.5390 8.7539 -4.4637 -1.7378
hfenergy: -954.4418967 hartree
pointgroup: C01 [X(C16H18N2O3)]
dipole: 0.2553591 1.8541559 -2.1393643 debye
polarizability: 304.5063462|29.6343162|155.7549854|2.0005474|-30.1975233|177.6104158 unknown
InChI: InChI=1S/C16H18N2O3/c1-4-20-15-13(10-17-16(18-15)21-5-2)14(19)12-8-6-11(3)7-9-12/h6-10H,4-5H2,1-3H3
charge 0 multiplicity 1
39 atoms
O  -0.396513 1.2888 -0.102336
O  -4.403487 -1.18545 -0.070438
O  1.182219 -1.193563 2.716741
N  -2.407619 0.065153 -0.124452
N  -2.600924 -2.045744 1.07994
C  2.095434 -0.415673 0.630002
C  -0.447965 -0.852269 1.009277
C  0.9627 -0.817375 1.5195
C  4.358864 0.256632 -0.98542
C  -1.100961 0.159475 0.239783
C  2.011678 -0.462721 -0.785163
C  3.326925 -0.036409 1.229979
C  3.130796 -0.137123 -1.578266
C  4.434593 0.304317 0.434289
C  -1.291927 -1.917466 1.424796
C  5.568041 0.596378 -1.837209
C  -3.089279 -1.038535 0.296602
C  -1.108901 2.359407 -0.864873
C  -5.016187 -0.111411 -0.906343
C  -0.086793 3.468689 -1.08962
C  -6.461356 -0.535059 -1.146122
H  1.076757 -0.770594 -1.265407
H  3.387127 -0.019544 2.323344
H  3.055367 -0.190354 -2.670972
H  5.374398 0.607493 0.911739
H  -0.877095 -2.70147 2.066294
H  6.316563 -0.218991 -1.804205
H  5.291611 0.750736 -2.894302
H  6.071468 1.511562 -1.476104
H  -1.483862 1.926786 -1.8101
H  -1.977312 2.693542 -0.269248
H  -4.939195 0.846656 -0.360431
H  -4.439319 -0.021236 -1.844967
H  -0.550865 4.293243 -1.661109
H  0.275421 3.870666 -0.12831
H  0.781855 3.093718 -1.657154
H  -6.976193 0.22375 -1.763338
H  -6.504439 -1.502994 -1.673584
H  -7.004221 -0.636421 -0.191213
