program: Gaussian 09
title: 000250646
version: EM64L-G09RevD.01
frameworkgroup: C1[X(C13H16Cl2N2O)]
method: RPBEPBE
basis: SDD
operation: Freq
keyword: #p
keyword: freq=noraman
keyword: PBEPBE/SDD
title: #p freq=noraman PBEPBE/SDD
converged: YES YES NO NO
title: Mulliken charges:
elementType: Cl Cl O N N C C C C C C C C C C C C C H H H H H H H H H H H H H H H H
charge: -0.024071 -0.018133 -0.294560 -0.450190 -0.504123 -0.024736 -0.456041 -0.420283 -0.407975 -0.402458 -0.377093 0.283351 0.525575 -0.464475 -0.349103 -0.024085 -0.181007 -0.123648 0.257421 0.217309 0.206209 0.196024 0.244834 0.174236 0.212874 0.208242 0.196075 0.196158 0.204155 0.285132 0.292492 0.247856 0.318639 0.255398
chargesum: 0.00000
title: Mulliken charges with hydrogens summed into heavy atoms:
elementType: Cl Cl O N N C C C C C C C C C C C C C
charge: -0.024071 -0.018133 -0.294560 -0.165058 -0.211632 0.232685 -0.032523 0.020575 -0.020865 0.001859 0.023220 0.283351 0.525575 -0.216619 -0.030464 -0.024085 0.074391 -0.123648
polarizability: 2.80766171e+02 -2.18711250e-01 1.67464041e+02 -8.62680684e+00 -1.23966445e+00 1.02494300e+02
1716.lowfreq: -21.0532 -2.8442 0.0016 0.0024 0.0024 8.0865 14.5873 34.4154 50.6032
frequency: -10.3299 33.7947 49.9054 56.5785 76.3473 114.9206 123.3251 171.2458 185.1536 194.7807 199.0551 220.5775 277.3455 302.0226 309.1045 344.7304 361.4846 388.9688 405.9163 432.1089 438.5425 467.8541 474.1487 493.8410 559.2832 591.1600 627.1497 651.2683 666.2286 685.5667 707.2337 764.4942 772.0682 800.0067 830.3207 833.6015 854.3834 857.4870 860.8947 882.5973 919.7662 967.7274 977.0363 993.5404 1008.5452 1035.2326 1046.9603 1060.4848 1088.1854 1115.5213 1122.2073 1142.9904 1150.3552 1156.2389 1205.0301 1240.1347 1244.5590 1259.6825 1271.6158 1290.7536 1301.8021 1325.1391 1329.8073 1334.6232 1343.2059 1350.2308 1356.4928 1370.6997 1393.8726 1455.3143 1459.9034 1463.5493 1466.8526 1470.9686 1475.5587 1484.4335 1498.9500 1578.1372 1606.7849 1642.7309 2945.9887 2969.0071 2970.6074 2979.7359 2984.9262 3027.7427 3030.9541 3034.3990 3040.2182 3045.9421 3057.6921 3141.9169 3163.9853 3199.0010 3528.8324 3545.6996
redmass: 4.9078 4.9400 5.4782 5.0543 6.3449 5.1932 4.4769 11.2986 4.9048 3.0494 4.9400 3.1061 7.4013 2.4154 2.8369 1.9126 3.0923 2.6218 3.1368 6.4316 3.1274 2.5779 3.0856 3.8754 1.7571 2.2239 2.7647 5.3100 7.2686 3.1171 9.6186 5.2690 1.5219 3.6017 2.1740 1.3286 1.6467 2.3474 2.4025 2.9446 1.4116 2.6932 1.3033 5.4105 2.9209 2.3295 1.4544 2.2332 1.7337 1.0514 2.2111 1.3660 2.1157 1.8334 1.7021 1.3882 1.3695 1.2725 1.3277 2.2481 1.7167 1.5360 1.3598 1.4201 2.4189 1.5402 1.5508 1.3657 5.6998 1.2281 1.3517 1.1045 1.2221 1.8184 1.1618 1.2701 2.3842 5.6740 6.4561 4.3212 1.0681 1.0662 1.0608 1.0637 1.0620 1.0905 1.0912 1.0935 1.1003 1.1015 1.0992 1.0920 1.0910 1.0953 1.0764 1.0771
irintensity: 0.0877 0.0796 3.1267 3.8214 9.1020 0.8511 2.2734 0.5190 1.6870 2.2515 0.8915 0.6423 11.1563 5.3839 4.4487 10.6374 2.3732 6.1999 8.8693 3.5919 9.9191 5.4466 8.9010 11.4941 119.5370 36.2144 0.6022 12.6211 10.4476 6.2304 10.8533 3.9019 1.1501 3.1954 5.9425 9.6371 71.8399 7.0940 11.5370 15.0835 10.5180 19.3495 3.3764 24.0639 13.6645 3.3214 3.4552 2.8635 1.2118 2.4037 68.5787 1.5982 7.5451 5.2106 248.1979 44.1372 12.3101 14.7722 42.4256 15.3034 15.5896 3.4743 1.5998 1.0938 111.8759 31.6137 19.9813 15.4444 5.4531 237.7448 305.5342 24.0279 54.5257 37.4466 48.8316 5.5361 668.3155 105.1445 90.4878 174.5595 38.0660 26.7367 39.3022 22.6824 30.4354 62.8105 73.1359 24.3093 31.9364 74.9855 54.8238 6.2448 1.8724 13.7039 4.5561 36.2780
temp: 298.150 k
press: 1.00000 atm
elementType: 17 17 8 7 7 6 6 6 6 6 6 6 6 6 6 6 6 6 1 1 1 1 1 1 1 1 1 1 1 1 1 1 1 1
symmnumber: 1
zpe: 710209.6 jmol-1
zpe.correction: 0.270505 hartree
zpe.thermalcorrener: 0.287060 hartree
zpe.thermalcorrenthalpy: 0.288004 hartree
zpe.thermalcorrgfe: 0.225195 hartree
zpe.sumelectzpe: -1608.513182 hartree
zpe.sumelectthermal: -1608.496627 hartree
zpe.sumelectthermalent: -1608.495683 hartree
zpe.sumelectthermalfe: -1608.558491 hartree
dipole: 6.0010 2.9542 -0.2613
dipole: 6.6938
quadrupole: -124.6172 -118.5923 -123.3080
quadrupole: 8.0481 -0.6289 -1.8581
quadrupole: -2.4447 3.5802 -1.1355 8.0481 -0.6289 -1.8581
hfenergy: -1608.7836863 hartree
pointgroup: C01 [X(C13H16Cl2N2O1)]
dipole: -2.3820825 -1.0942187 -0.2530305 debye
polarizability: 280.4615012|-3.6477182|166.5394029|10.6016259|7.966444|103.7236087 unknown
InChI: InChI=1S/C13H16Cl2N2O/c14-11-7-6-10(8-12(11)15)17-13(18)16-9-4-2-1-3-5-9/h6-9,16-17H,1-5H2
charge 0 multiplicity 1
34 atoms
Cl 5.08284 -2.357621 -0.056256
Cl 6.207301 0.710894 0.437613
O  -0.686475 1.748978 -0.191889
N  -2.031826 -0.130846 -0.498821
N  0.290012 -0.405338 -0.313409
C  -3.285173 0.660146 -0.55561
C  -4.356412 -0.114301 -1.362075
C  -3.806584 1.017297 0.863899
C  -4.905652 -1.349194 -0.602053
C  -4.340911 -0.220578 1.620748
C  -5.42891 -0.956151 0.800987
C  -0.803674 0.492297 -0.321415
C  1.659473 -0.091852 -0.133505
C  2.58348 -1.171522 -0.169805
C  2.142986 1.229349 0.078224
C  3.958734 -0.934907 0.002278
C  3.524091 1.443757 0.249662
C  4.440969 0.372721 0.213728
H  -3.02855 1.59938 -1.078869
H  -3.945732 -0.406411 -2.3479
H  -5.196178 0.581198 -1.55662
H  -4.622445 1.760298 0.750787
H  -2.995886 1.512843 1.427794
H  -4.116254 -2.125218 -0.49322
H  -5.711303 -1.820483 -1.196723
H  -4.745725 0.08622 2.603873
H  -3.503003 -0.917478 1.830431
H  -6.307013 -0.288047 0.682701
H  -5.780158 -1.85461 1.34395
H  -2.106802 -1.14809 -0.541753
H  0.085865 -1.39398 -0.472561
H  2.240194 -2.199327 -0.331522
H  1.437142 2.060419 0.101905
H  3.899683 2.458356 0.41243
