program: Gaussian 09
title: 000253499
version: EM64L-G09RevD.01
frameworkgroup: C1[X(C22H17N5O)]
method: RPBEPBE
basis: SDD
operation: Freq
keyword: #p
keyword: freq=noraman
keyword: PBEPBE/SDD
title: #p freq=noraman PBEPBE/SDD
converged: YES YES NO NO
title: Mulliken charges:
elementType: O N N N N N C C C C C C C C C C C C C C C C C C C C C C H H H H H H H H H H H H H H H H H
charge: -0.310808 -0.093182 -0.076108 -0.181925 -0.266713 -0.348710 0.289176 0.287060 0.004623 -0.030093 0.023830 -0.345534 -0.339220 -0.351221 -0.344798 0.278821 -0.230593 -0.231695 -0.231231 -0.232237 0.187273 -0.227437 -0.227356 -0.345096 -0.346230 -0.218750 -0.234456 -0.225306 0.272156 0.248176 0.268832 0.275432 0.369676 0.230579 0.228203 0.228908 0.230212 0.361721 0.231748 0.230702 0.276301 0.214513 0.234606 0.231596 0.234556
chargesum: 0.00000
title: Mulliken charges with hydrogens summed into heavy atoms:
elementType: O N N N N N C C C C C C C C C C C C C C C C C C C C C C
charge: -0.310808 -0.093182 -0.076108 -0.181925 0.102963 0.013011 0.289176 0.287060 0.004623 -0.030093 0.023830 -0.073378 -0.091044 -0.082389 -0.069366 0.278821 -0.000014 -0.003492 -0.002323 -0.002025 0.187273 0.004311 0.003346 -0.068795 -0.131717 0.015857 -0.002860 0.009250
polarizability: 4.94489325e+02 -1.80858993e+01 3.72015932e+02 6.14172134e+00 8.01810707e+00 1.06352640e+02
1716.lowfreq: -5.1042 -0.0008 -0.0006 -0.0003 2.5607 4.7368 20.2399 21.8063 28.8520
frequency: 20.2082 21.7715 28.8504 30.4697 36.0194 55.1009 71.1563 82.7291 102.7828 107.6335 148.5992 179.6495 191.2071 200.7855 217.2496 231.7038 263.6613 266.0534 296.0701 340.3306 387.4686 400.1738 403.0183 405.2944 417.0240 443.4278 450.6511 474.3922 498.2328 564.1157 590.3839 614.2200 614.9262 616.4182 618.6426 630.5180 648.1084 661.3885 675.5769 677.7380 688.3432 694.6027 698.9757 701.7526 704.0130 768.8845 788.1775 802.0787 824.8630 833.4966 852.7943 860.0872 861.7272 866.6670 908.5073 934.6716 953.5792 957.1448 958.0779 984.7649 989.4222 989.9227 991.4201 994.4440 1000.4524 1007.6833 1008.9087 1010.6131 1020.4418 1022.4987 1023.9478 1061.4946 1072.1793 1075.5725 1088.4540 1098.2656 1141.4364 1172.0208 1172.4947 1174.4894 1177.3024 1180.0057 1190.9414 1200.1961 1224.2786 1252.3444 1291.4253 1306.1927 1315.3103 1322.0913 1347.6515 1366.3520 1386.6273 1390.9640 1391.7867 1427.1667 1432.2037 1434.5086 1452.6557 1455.9410 1469.1436 1485.3190 1487.3802 1499.9217 1551.8790 1587.9379 1589.6861 1593.1702 1601.8468 1612.3078 1612.9371 1616.8200 3121.3612 3127.7763 3128.3666 3134.3886 3140.9099 3141.4366 3147.4534 3155.8590 3156.1490 3159.7686 3168.7983 3169.7371 3171.4285 3175.5542 3176.1441 3496.4895 3525.1454
redmass: 4.1785 5.0281 4.6192 4.5997 4.0932 7.2362 5.3285 6.8126 5.9424 6.1956 6.0277 6.3159 7.7356 6.1618 6.4338 5.5525 5.9086 6.3337 7.2813 7.7872 5.9493 2.8077 2.8306 2.8574 6.5437 3.6976 4.5033 3.5685 5.6902 7.0282 1.2942 6.4986 6.0115 5.5627 1.1840 7.9749 7.4321 6.8621 5.3012 4.6145 3.7733 5.1258 1.6623 1.6113 1.6384 2.3221 2.1722 2.2913 7.4342 4.9098 1.2560 7.0909 1.2531 1.2449 11.9835 1.4295 1.4581 5.2588 1.4417 1.4145 5.6082 6.2129 6.0803 1.3910 1.3770 1.3405 1.3365 1.3326 2.5238 2.1846 2.4443 2.4925 1.8201 1.5258 1.7724 2.4725 3.2073 1.0626 1.0574 1.0627 1.2102 1.1334 1.1954 3.3973 6.5760 1.7817 2.0967 1.4252 1.4829 1.3892 4.2278 3.4467 8.8232 9.6382 9.2847 2.9598 2.7292 2.3942 3.3482 2.9663 3.8594 2.6454 2.6629 3.1757 5.2919 6.4033 6.3170 5.2272 7.6098 6.1889 6.0417 6.6309 1.0872 1.0854 1.0853 1.0873 1.0894 1.0896 1.0920 1.0945 1.0943 1.0959 1.0948 1.0947 1.1008 1.0987 1.0984 1.0798 1.0788
irintensity: 0.0671 0.6835 0.5504 0.5357 0.4353 0.6152 0.5245 4.8175 0.0610 0.8326 0.7896 1.8263 0.2045 6.2371 0.1449 0.0076 0.4088 16.3633 2.1876 0.8976 1.1226 0.2026 0.0186 0.0007 1.5105 0.1523 9.5193 7.2873 10.0903 29.3378 57.1646 0.8122 1.8484 4.1383 103.2697 32.0947 1.6825 0.8305 9.5119 22.9148 8.0643 10.0262 60.4122 101.4904 47.9863 125.3016 37.9786 0.3517 5.0705 0.3560 1.1644 7.8133 0.0850 0.0155 6.0491 3.6754 2.1257 12.1649 6.6197 1.0279 0.4851 1.4114 0.6104 0.0619 0.0087 1.2587 0.0886 1.0855 36.3490 15.9721 2.4129 5.7445 19.2963 5.7645 4.6650 18.4419 9.5610 2.3905 0.2784 1.3580 66.5899 42.9246 6.4476 13.4802 28.2737 0.7698 27.7848 8.5749 14.1750 17.6503 289.8958 240.5240 1.3019 34.8795 88.4805 345.3662 164.4614 83.3901 526.5206 275.2272 1168.6529 26.4165 365.5038 45.0988 149.8265 7.9019 9.9570 226.9496 74.6156 23.8292 9.1230 37.5071 12.7344 0.0239 0.0362 1.9085 11.2202 15.3427 22.4150 35.3953 22.8050 13.7317 13.3519 10.1871 24.7655 29.2715 14.0691 51.0503 289.2786
temp: 298.150 k
press: 1.00000 atm
elementType: 8 7 7 7 7 7 6 6 6 6 6 6 6 6 6 6 6 6 6 6 6 6 6 6 6 6 6 6 1 1 1 1 1 1 1 1 1 1 1 1 1 1 1 1 1
symmnumber: 1
zpe: 903145.8 jmol-1
zpe.correction: 0.343990 hartree
zpe.thermalcorrener: 0.366711 hartree
zpe.thermalcorrenthalpy: 0.367655 hartree
zpe.thermalcorrgfe: 0.288135 hartree
zpe.sumelectzpe: -1195.625482 hartree
zpe.sumelectthermal: -1195.602761 hartree
zpe.sumelectthermalent: -1195.601817 hartree
zpe.sumelectthermalfe: -1195.681337 hartree
dipole: -0.7799 3.4651 0.0477
dipole: 3.5521
quadrupole: -125.1182 -149.3328 -170.7149
quadrupole: -12.3541 1.0188 1.7957
quadrupole: 23.2704 -0.9442 -22.3262 -12.3541 1.0188 1.7957
hfenergy: -1195.9694719 hartree
pointgroup: C01 [X(C22H17N5O1)]
dipole: -0.3934852 1.3403672 -0.0402571 debye
polarizability: 496.2658135|-9.8432761|370.4373845|7.0600557|-3.0617391|106.154699 unknown
InChI: InChI=1S/C22H17N5O/c28-21(18-14-8-3-9-15-18)26-27-22-24-19(16-10-4-1-5-11-16)23-20(25-22)17-12-6-2-7-13-17/h1-15,26-27H
charge 0 multiplicity 1
45 atoms
O  -2.978635 -3.323141 0.088693
N  2.413159 0.725192 -0.01375
N  1.494961 -1.517782 0.100362
N  0.010842 0.430714 -0.004075
N  -0.830278 -1.740907 0.113758
N  -2.113163 -1.193614 0.093965
C  0.95773 2.689379 -0.131888
C  3.918489 -1.209275 0.095838
C  1.134296 1.217569 -0.045631
C  2.547448 -0.645398 0.059205
C  0.261438 -0.922065 0.068301
C  2.09565 3.539898 -0.144763
C  -0.340062 3.261931 -0.205066
C  5.047775 -0.348656 0.047852
C  4.112067 -2.614466 0.180661
C  -4.552852 -1.444907 0.096201
C  1.936354 4.937921 -0.228128
C  -0.496874 4.66017 -0.289751
C  6.350311 -0.886905 0.084456
C  5.415744 -3.14856 0.217335
C  -3.190476 -2.062834 0.095147
C  0.640573 5.503027 -0.300966
C  6.538781 -2.28728 0.169456
C  -5.647424 -2.291025 -0.217198
C  -4.794269 -0.081081 0.412589
C  -6.961101 -1.779336 -0.232298
C  -6.110161 0.428088 0.398427
C  -7.196267 -0.417616 0.071625
H  3.086641 3.080673 -0.089088
H  -1.209142 2.597784 -0.198081
H  4.878308 0.729894 -0.017362
H  3.231393 -3.262339 0.216624
H  -0.791646 -2.764454 0.144242
H  2.818061 5.587971 -0.236874
H  -1.500724 5.09505 -0.348295
H  7.218063 -0.219183 0.047036
H  5.559431 -4.232591 0.283035
H  -2.110612 -0.171134 0.021858
H  0.517822 6.590016 -0.366568
H  7.551947 -2.704123 0.197988
H  -5.439668 -3.342774 -0.439096
H  -3.974343 0.586173 0.70492
H  -7.800169 -2.43892 -0.478362
H  -6.290221 1.478601 0.650965
H  -8.2170 -0.019885 0.062399
