program: Gaussian 09
title: 000253412
version: EM64L-G09RevD.01
frameworkgroup: C1[X(C7H9N7)]
method: RPBEPBE
basis: SDD
operation: Freq
keyword: #p
keyword: freq=noraman
keyword: PBEPBE/SDD
title: #p freq=noraman PBEPBE/SDD
converged: YES YES NO NO
title: Mulliken charges:
elementType: N N N N N N N C C C C C C C H H H H H H H H H
charge: -0.038494 -0.043499 -0.012423 -0.350676 -0.043038 0.026731 -0.495929 0.008052 -0.449680 0.009056 0.099165 -0.057245 -0.678380 -0.367074 0.233294 0.228413 0.220291 0.229738 0.247390 0.360742 0.253313 0.310062 0.310191
chargesum: 0.00000
title: Mulliken charges with hydrogens summed into heavy atoms:
elementType: N N N N N N N C C C C C C C
charge: -0.038494 -0.043499 -0.012423 0.010065 -0.043038 0.026731 0.124324 0.008052 0.012028 0.009056 0.099165 -0.057245 0.019039 -0.113761
polarizability: 1.85687895e+02 4.58391418e-01 1.38023620e+02 5.46351506e+00 2.83463370e+00 6.67267873e+01
1716.lowfreq: -73.1371 -13.2417 -2.8211 -0.0007 -0.0007 -0.0004 6.7011 20.7879 57.2463
frequency: -73.0683 20.2197 57.2389 106.5732 143.9025 166.4617 178.0290 213.3683 239.6465 291.9674 352.5644 361.6383 408.8523 463.1909 500.1623 512.6774 559.0702 613.0849 635.0211 659.0467 709.7192 742.3741 752.9275 781.1244 786.4438 841.9000 843.7815 883.8306 948.5746 964.7571 1004.1617 1044.1560 1059.3874 1092.2944 1158.8411 1190.3341 1201.5446 1243.7322 1277.7852 1285.2687 1308.6565 1319.8084 1357.3383 1381.7620 1384.1779 1409.6484 1438.3150 1449.5869 1463.2164 1474.9485 1488.5114 1526.0637 1544.3525 1677.1841 2989.8861 3016.7299 3076.7812 3092.3990 3103.4507 3164.5653 3390.4044 3506.4708 3535.0020
redmass: 1.3204 2.5611 5.1515 3.7034 3.4162 4.1842 5.1202 1.2607 3.7874 2.5680 3.6907 4.6113 9.7067 5.8864 6.4798 8.9315 4.7583 8.0954 8.5334 1.0991 5.0036 2.9741 4.4103 1.5544 2.9160 9.1074 5.7831 5.9403 1.4727 2.2526 4.3092 5.0188 1.9709 2.7176 6.8973 4.8869 3.2990 2.0266 1.9146 1.1580 1.6992 2.8218 4.7608 1.9189 1.2484 2.1300 3.6607 1.7228 1.9259 1.0534 1.1605 3.5592 8.2117 1.0615 1.0345 1.0598 1.1011 1.1009 1.1025 1.0924 1.0429 1.0988 1.0787
irintensity: 35.7769 0.5204 1.7135 2.7571 1.1965 0.7568 13.1393 0.3022 0.7888 2.8644 12.0410 3.3827 6.1843 3.2085 0.1671 1.6571 8.3916 5.9514 5.1437 142.6145 16.9793 90.3204 3.1341 43.9196 36.6496 2.1114 2.8110 7.4500 8.3535 22.8868 17.7079 0.4019 33.7343 9.9318 7.3234 15.8297 0.4168 18.2662 53.5771 0.3920 25.2021 67.4233 102.7940 22.7180 11.8263 15.0487 12.5033 30.7134 37.5757 17.8041 31.2854 82.0704 343.0097 31.9122 30.6736 13.8594 3.8892 35.6532 26.0726 16.9136 1.4691 4.2129 84.1509
temp: 298.150 k
press: 1.00000 atm
elementType: 7 7 7 7 7 7 7 6 6 6 6 6 6 6 1 1 1 1 1 1 1 1 1
symmnumber: 1
zpe: 450961.7 jmol-1
zpe.correction: 0.171762 hartree
zpe.thermalcorrener: 0.183731 hartree
zpe.thermalcorrenthalpy: 0.184675 hartree
zpe.thermalcorrgfe: 0.132217 hartree
zpe.sumelectzpe: -654.314921 hartree
zpe.sumelectthermal: -654.302952 hartree
zpe.sumelectthermalent: -654.302008 hartree
zpe.sumelectthermalfe: -654.354466 hartree
dipole: 0.9809 -4.7590 -0.0012
dipole: 4.8590
quadrupole: -72.3542 -97.0126 -78.9424
quadrupole: 6.2126 0.1526 -0.0588
quadrupole: 10.4155 -14.2429 3.8274 6.2126 0.1526 -0.0588
hfenergy: -654.486683 hartree
pointgroup: C01 [X(C7H9N7)]
dipole: 0.2721823 1.8876284 0.1313993 debye
dipolederiv: -0.4401004 0.3578316 0.0252857 -0.1177704 -0.3319925 -0.0088594 0.0047645 -0.0590288 -0.2568041 -0.3372891 -0.1634066 -0.0040501 0.689187 0.0430769 -0.0034079 0.1285436 0.0598932 -0.1823471 0.0561498 0.4280437 0.0104472 -0.1233589 0.046091 0.0509 -0.0584333 0.0037356 -0.2763656 0.0839165 0.1633397 -0.0300003 -0.4172153 -1.0511593 -0.0531286 -0.1074124 -0.1032972 -0.4079061 -0.2904372 0.4417676 0.0658174 -0.2768997 -1.028638 -0.0834759 -0.0283453 -0.1532941 -0.2334998 -1.0775039 -0.0101176 0.0735307 -0.021842 -0.427273 -0.0256423 0.0888196 -0.0278661 -0.2185208 -0.045687 0.13029 0.017169 0.0039248 -0.4354833 -0.0520031 -0.0001209 -0.0634263 -0.058715 -0.1362201 -0.4512384 -0.0300489 0.3987578 -0.0982844 -0.0690147 0.0918298 0.0106886 0.1743385 -0.2775101 0.1256269 -0.0350456 0.0873931 0.0804836 0.0100756 -0.2189002 0.056566 0.02817 0.7515249 -0.4283028 -0.0340164 -0.7349623 0.0203655 -0.0072266 -0.1195212 0.0134534 0.1587354 0.1090856 -0.0827708 -0.0076535 0.3994769 1.4550288 0.1498069 0.0531542 0.1806274 0.1494467 0.4726545 -0.3206292 -0.0541329 -0.6158323 -0.07855 0.0050506 -0.0985037 -0.0227609 0.3171369 0.0364118 0.0067267 -0.0290222 0.0858338 0.0510872 -0.0132972 0.1707052 -0.0651701 0.0318546 0.7765986 0.0123053 -0.0801409 0.3382086 0.8900048 0.0961051 -0.0452851 0.1208347 -0.0242028 0.0251549 -0.0133075 0.0639964 -0.0093063 0.0360036 0.0945909 0.0685033 0.0483945 -0.0123874 0.0352301 -0.0611727 -0.052259 0.0148008 -0.0585866 -0.0916897 -0.0116029 -0.0614152 0.0387315 0.0277041 -0.0888445 0.0898074 -0.0526848 0.0283445 0.0971639 0.0282585 0.0762168 -0.0419614 -0.1718924 0.123821 0.0085168 0.1447534 0.0498809 -0.0085454 -0.0239375 -0.0074928 0.0669646 0.1266209 -0.0120255 -0.022964 -0.0618873 -0.0710141 -0.0871707 -0.0066113 -0.04876 0.045381 0.1315099 -0.0959245 0.0101024 0.0050173 0.2906421 -0.0013687 0.0233437 0.0078047 0.3266663 -0.0294536 0.0833779 0.0265002 0.0620299 0.0441278 -0.0167864 0.025811 -0.0195051 0.1175413 0.0917777 -0.0897324 0.0359508 0.0852301 0.3032595 -0.1300701 0.0148678 -0.0792438 0.0909596 0.0817545 -0.0556579 -0.0477902 0.1171459 0.2425852 0.1479937 0.0200725 0.1330457 0.1667838 unknown
polarizability: 185.4848002|2.8813498|137.4427248|-6.2702807|7.4536127|67.5107771 unknown
InChI: InChI=1S/C7H9N7/c1-2-4-11-5-6(12-8)9-3-10-7(5)14-13-4/h3,12H,2,8H2,1H3
charge 0 multiplicity 1
23 atoms
N  -0.851675 0.924702 0.237837
N  -2.13275 -1.157095 0.105082
N  -1.03294 -1.908066 -0.113719
N  1.695547 2.132805 0.115741
N  2.697976 0.020393 -0.265687
N  1.338136 -2.029978 -0.385392
N  2.918069 2.849079 0.072275
C  0.270778 0.162784 0.015593
C  -3.320875 0.968249 0.484726
C  -2.020089 0.239131 0.277615
C  1.590574 0.778352 -0.047289
C  0.211002 -1.255618 -0.163075
C  -4.116931 1.098936 -0.842657
C  2.498231 -1.339572 -0.420345
H  -3.930046 0.402666 1.212627
H  -3.104681 1.965776 0.903321
H  -3.550746 1.683552 -1.589631
H  -5.077304 1.611771 -0.65995
H  -4.329382 0.101727 -1.265245
H  0.842297 2.67329 0.278666
H  3.407333 -1.923457 -0.594964
H  3.367902 2.736816 -0.848019
H  3.550772 2.526656 0.818989
