program: Gaussian 09
title: 000253431
version: EM64L-G09RevD.01
frameworkgroup: C1[X(C14H12N2O5)]
method: RPBEPBE
basis: SDD
operation: Freq
keyword: #p
keyword: freq=noraman
keyword: PBEPBE/SDD
title: #p freq=noraman PBEPBE/SDD
converged: YES YES NO NO
title: Mulliken charges:
elementType: O O O O O N N C C C C C C C C C C C C C C H H H H H H H H H H H H
charge: -0.262565 -0.185521 -0.172809 -0.204699 -0.198666 0.011882 0.020283 0.149655 0.178850 0.378218 0.242126 -0.377652 -0.439441 -0.811275 0.282252 -0.209790 -0.808270 -0.274824 -0.478669 0.427666 -0.380406 0.268219 0.239359 0.233285 0.287188 0.232647 0.237649 0.230967 0.236830 0.232473 0.291102 0.329934 0.294003
chargesum: 0.00000
title: Mulliken charges with hydrogens summed into heavy atoms:
elementType: O O O O O N N C C C C C C C C C C C C C C
charge: -0.262565 -0.185521 -0.172809 -0.204699 -0.198666 0.011882 0.020283 0.149655 0.178850 0.378218 0.242126 -0.109434 -0.200083 -0.058156 0.282252 0.027859 -0.108000 0.016278 -0.148735 0.427666 -0.086403
polarizability: 2.91116534e+02 9.21017900e-01 1.87636140e+02 5.38688889e+00 -8.45739507e+00 1.27217703e+02
1716.lowfreq: -4.4835 -0.0005 0.0003 0.0006 4.7082 6.5781 15.3517 29.6379 47.3890
frequency: 12.6417 29.4564 47.3855 57.5952 59.2734 89.9125 111.6080 129.5468 144.3491 152.4112 158.2217 184.2636 227.2278 253.8507 275.2544 304.0456 309.3582 330.0557 352.3191 370.7935 422.3030 474.6300 487.1657 495.8270 509.0233 514.5420 529.8374 554.1199 600.9790 631.8744 652.7197 660.4444 690.6785 710.4330 722.9969 746.3566 756.4845 767.0964 791.8590 811.8204 845.7722 872.5709 901.5706 907.3339 949.9582 973.7772 991.5648 991.8532 1028.4579 1046.1050 1054.5357 1057.6841 1087.2941 1113.0540 1144.2482 1166.3044 1189.2363 1205.9534 1216.1165 1220.6972 1247.6106 1256.2657 1264.2868 1358.6222 1371.0495 1372.9803 1396.8849 1400.3982 1407.8531 1428.7103 1431.8630 1462.9111 1465.1066 1467.0913 1475.7059 1479.6660 1489.9876 1579.7749 1585.1685 1609.6997 1616.8535 2975.9555 2978.8355 3049.9904 3055.6777 3091.5429 3109.0427 3132.6731 3149.6309 3169.1960 3170.9626 3187.5098 3189.4486
redmass: 4.5445 5.6046 8.8899 14.3600 6.4828 6.0856 1.2543 2.5242 10.2232 5.6716 1.0866 7.0796 3.3842 4.1856 5.2432 3.7599 5.1001 4.5335 8.7399 7.2327 4.3150 4.0858 4.4271 5.1319 3.1937 5.3469 5.0606 5.6677 5.9708 7.2393 7.6868 7.1497 5.8780 6.5040 2.5751 4.7507 11.5593 5.2070 1.6365 4.6396 1.4456 5.4000 1.3734 3.2305 1.4673 1.3291 1.4048 1.3843 1.4356 2.1088 1.6268 2.0692 1.8015 4.5850 1.3119 1.4783 2.6305 7.9194 2.7366 5.9056 2.3872 1.9614 2.1031 6.9933 6.2986 11.7585 1.2586 8.1942 1.2297 2.0274 4.8959 1.5596 1.6637 2.1423 1.3162 1.2215 1.0575 6.6149 8.3072 7.2951 6.8524 1.0380 1.0404 1.0964 1.0952 1.0986 1.0983 1.0877 1.0912 1.0984 1.0902 1.0931 1.0961
irintensity: 0.1042 0.8593 0.5035 0.0893 0.4259 4.0021 0.1810 0.1348 3.4299 1.3864 1.3101 0.9280 0.3105 6.2369 3.0295 0.1167 0.5557 2.0632 0.2240 0.8849 0.8574 1.9764 0.5703 3.9557 0.4756 2.1916 4.5534 0.8162 2.0855 13.8103 14.8331 10.4729 11.0765 9.1636 21.5213 5.6737 15.3814 7.9429 49.5291 0.0599 28.1054 7.2278 0.3486 38.0214 24.6206 0.3436 5.1200 1.6177 11.5269 44.0280 0.9204 121.2476 32.9781 9.7825 40.8349 59.9648 48.7279 368.4937 36.3748 265.0506 266.0689 23.8689 30.0178 100.9676 1.6486 81.4254 0.5642 56.2982 30.5524 63.2250 4.6576 1.8975 38.6149 142.8504 40.5776 18.3388 24.7678 65.3224 23.6901 204.1172 10.2289 36.5874 10.9064 27.7514 5.3406 20.9939 1.5283 6.7089 17.3863 8.5485 1.9803 13.6214 5.9214
temp: 298.150 k
press: 1.00000 atm
elementType: 8 8 8 8 8 7 7 6 6 6 6 6 6 6 6 6 6 6 6 6 6 1 1 1 1 1 1 1 1 1 1 1 1
symmnumber: 1
zpe: 625191.2 jmol-1
zpe.correction: 0.238123 hartree
zpe.thermalcorrener: 0.257194 hartree
zpe.thermalcorrenthalpy: 0.258139 hartree
zpe.thermalcorrgfe: 0.188152 hartree
zpe.sumelectzpe: -1024.635996 hartree
zpe.sumelectthermal: -1024.616925 hartree
zpe.sumelectthermalent: -1024.615980 hartree
zpe.sumelectthermalfe: -1024.685967 hartree
dipole: -7.4309 -3.4322 -0.5950
dipole: 8.2068
quadrupole: -133.8271 -136.1594 -116.1358
quadrupole: 8.9787 4.3517 -7.5919
quadrupole: -5.1197 -7.4520 12.5716 8.9787 4.3517 -7.5919
hfenergy: -1024.8741189 hartree
pointgroup: C01 [X(C14H12N2O5)]
dipole: -2.8405747 -1.3632486 0.705615 debye
polarizability: 290.7966491|5.3254165|164.0183226|-4.770768|-31.0515023|151.1554051 unknown
InChI: InChI=1S/C14H12N2O5/c1-9-4-3-5-13(10(9)2)21-14-7-6-11(15(17)18)8-12(14)16(19)20/h3-8H,1-2H3
charge 0 multiplicity 1
33 atoms
O  -0.853708 0.843953 -0.026563
O  2.207745 3.191623 -1.070302
O  0.203337 2.502652 -1.919553
O  4.556452 -2.523727 0.454763
O  5.331027 -0.603439 -0.510447
N  1.270366 2.316681 -1.222772
N  4.38345 -1.339885 -0.034327
C  -3.006773 -0.21976 -0.43146
C  -2.005537 0.151086 0.495891
C  -4.191069 -0.825012 0.095456
C  0.386332 0.240352 -0.051438
C  -2.125506 -0.014384 1.8899
C  -4.317341 -1.016047 1.49391
C  -2.83006 0.026988 -1.917023
C  1.476875 0.990746 -0.591431
C  -3.301065 -0.611257 2.38918
C  -5.309926 -1.249199 -0.837552
C  0.645906 -1.060069 0.460071
C  2.789027 0.492108 -0.567252
C  3.009331 -0.796632 -0.047887
C  1.946559 -1.583043 0.454709
H  -1.330619 0.331934 2.557804
H  -5.229877 -1.478523 1.886694
H  -3.726586 0.510813 -2.344955
H  -1.963949 0.676902 -2.116331
H  -2.68786 -0.923736 -2.467044
H  -3.426512 -0.751413 3.467639
H  -4.94939 -1.946272 -1.617165
H  -5.745861 -0.380135 -1.366743
H  -6.122212 -1.748387 -0.283698
H  -0.182317 -1.648385 0.862874
H  3.619359 1.089562 -0.952556
H  2.159104 -2.58439 0.838007
