program: Gaussian 09
title: 000253421
version: EM64L-G09RevD.01
frameworkgroup: C1[X(C13H19NO2)]
method: RPBEPBE
basis: SDD
operation: Freq
keyword: #p
keyword: freq=noraman
keyword: PBEPBE/SDD
title: #p freq=noraman PBEPBE/SDD
converged: YES YES NO NO
title: Mulliken charges:
elementType: O O N C C C C C C C C C C C C C H H H H H H H H H H H H H H H H H H H
charge: -0.256256 -0.249818 -0.433856 -0.355621 -0.453802 -0.372475 -0.344370 -0.321396 0.464198 -0.369101 -0.429158 -0.220937 -0.195503 -0.276966 0.291401 -0.757183 0.193011 0.202435 0.215106 0.208327 0.233247 0.207439 0.211854 0.209163 0.232113 0.224105 0.293739 0.236824 0.210665 0.215837 0.217537 0.222863 0.247741 0.252564 0.246272
chargesum: 0.00000
title: Mulliken charges with hydrogens summed into heavy atoms:
elementType: O O N C C C C C C C C C C C C C
charge: -0.256256 -0.249818 -0.140116 0.039825 -0.030369 0.068211 0.076647 0.134822 0.464198 -0.132276 -0.218493 -0.005100 0.022034 -0.054103 0.291401 -0.010606
polarizability: 2.26930240e+02 -8.04819543e+00 1.39385756e+02 3.64323746e+00 -4.08337939e+00 1.01284609e+02
1716.lowfreq: -39.6125 -15.8393 -4.7216 -0.0009 -0.0005 0.0008 3.6492 10.3369 20.4940
frequency: -39.5754 8.0814 20.3250 38.7455 44.4274 71.8862 81.2945 88.4743 122.3338 139.0795 160.9248 187.1338 225.4879 276.8786 283.3167 286.0083 353.2968 409.5224 417.1729 449.9494 506.0153 508.3576 579.1576 594.3864 614.4312 626.9593 690.3166 739.1494 753.1657 761.2898 785.8510 812.4825 825.7868 851.9556 867.6010 943.9732 952.3003 970.8673 973.3261 976.2275 1001.3240 1017.3177 1024.4271 1037.7154 1046.7722 1077.4926 1081.7118 1089.0537 1130.9337 1150.8466 1168.3674 1183.6662 1187.7023 1198.1730 1234.4382 1246.7959 1278.7005 1280.1500 1289.9828 1297.1643 1312.3372 1330.1283 1350.7986 1368.6177 1373.7613 1385.3848 1387.9165 1431.5646 1451.5374 1456.4530 1458.2690 1467.2198 1470.2962 1481.1768 1483.8382 1500.9445 1511.3068 1588.9586 1626.7539 1644.9807 2918.7812 2953.7098 2960.6341 2968.3005 2991.5098 3004.0876 3008.0037 3019.2161 3032.5437 3055.5922 3096.1253 3100.4219 3105.9626 3122.0406 3134.6214 3139.5625 3151.7112 3165.5988 3571.3077
redmass: 1.0899 4.0143 4.8787 3.7487 5.1260 2.0098 3.5788 3.2889 1.8973 2.6275 4.3414 5.3071 3.6038 3.2693 2.3695 1.3750 3.8057 2.9242 3.4647 4.0489 2.6642 3.6252 3.4040 5.3453 6.4033 4.3779 1.8161 1.0742 1.7924 1.5350 1.9332 1.2689 4.9607 1.3203 1.5188 4.5889 1.3677 1.2973 1.2869 5.8393 1.9055 3.2718 2.8522 3.8467 1.6443 2.1829 1.7791 3.2946 3.3560 1.6722 1.0481 1.3504 1.1098 3.7066 1.2705 1.2609 1.4357 1.1154 1.0983 1.1186 1.4079 1.5355 1.4719 1.7847 1.3600 1.2504 2.9783 2.4081 1.0852 1.0790 1.0470 1.0681 1.0882 1.8422 1.1073 1.2404 2.0696 5.0847 6.2742 9.5566 1.0569 1.1030 1.0589 1.0588 1.0603 1.0990 1.0368 1.0581 1.1041 1.1037 1.0968 1.1081 1.0871 1.0858 1.0929 1.1013 1.0934 1.1006 1.0769
irintensity: 1.8634 0.9711 0.6671 0.0247 0.7021 2.2863 1.4724 6.7507 2.7723 5.3466 1.4503 0.1350 0.3491 5.7466 38.8065 50.3144 7.9943 0.0928 5.8256 3.9276 14.8747 1.7265 4.6623 0.1066 0.4901 7.8795 43.0623 13.7498 72.2862 18.2780 3.9902 0.6671 10.7291 0.1548 10.3435 44.9773 0.4038 2.9657 5.0696 5.2488 38.0914 12.3603 2.1271 27.0798 10.7358 3.8529 3.8287 1.7214 17.2242 1.4039 1.6930 0.6205 10.0381 370.4982 8.6040 4.4879 25.4273 6.4836 3.0331 0.2062 1.8681 35.3399 10.4747 1.8154 8.8236 42.7659 53.8312 17.8257 7.0596 18.3916 17.3586 0.3196 3.2839 2.2924 19.5920 133.4442 117.8704 11.0964 227.6703 176.2266 55.4187 30.7829 1.3329 54.3559 23.4198 0.9478 3.1514 44.5252 41.9408 46.0328 7.7592 29.4932 16.7257 4.0720 32.5503 9.2432 45.5422 13.4074 28.6680
temp: 298.150 k
press: 1.00000 atm
elementType: 8 8 7 6 6 6 6 6 6 6 6 6 6 6 6 6 1 1 1 1 1 1 1 1 1 1 1 1 1 1 1 1 1 1 1
symmnumber: 1
zpe: 775196.0 jmol-1
zpe.correction: 0.295257 hartree
zpe.thermalcorrener: 0.312162 hartree
zpe.thermalcorrenthalpy: 0.313107 hartree
zpe.thermalcorrgfe: 0.246199 hartree
zpe.sumelectzpe: -710.760703 hartree
zpe.sumelectthermal: -710.743797 hartree
zpe.sumelectthermalent: -710.742853 hartree
zpe.sumelectthermalfe: -710.809761 hartree
dipole: -2.2695 0.5743 -1.8991
dipole: 3.0145
quadrupole: -101.5632 -87.7409 -106.7512
quadrupole: -1.3625 7.5129 -1.3100
quadrupole: -2.8781 10.9442 -8.0661 -1.3625 7.5129 -1.3100
hfenergy: -711.0559596 hartree
pointgroup: C01 [X(C13H19N1O2)]
dipole: 0.882029 -0.4480718 -0.6540714 debye
polarizability: 226.4834511|-10.7559015|138.9989365|-1.552141|-6.8538543|102.1182179 unknown
InChI: InChI=1S/C13H19NO2/c1-12(15)16-11-7-3-6-10-14-13-8-4-2-5-9-13/h2,4-5,8-9,14H,3,6-7,10-11H2,1H3
charge 0 multiplicity 1
35 atoms
O  5.263484 -0.083939 -0.711152
O  5.460704 0.209544 1.596306
N  -2.203653 -0.680655 0.108911
C  1.44152 0.453229 -0.405993
C  0.252024 -0.488086 -0.116978
C  2.799964 -0.283474 -0.356416
C  -1.099697 0.252561 -0.120647
C  3.966371 0.658541 -0.683018
C  -3.547965 -0.307905 0.158014
C  -3.956382 1.048985 -0.013628
C  -4.553866 -1.297333 0.384015
C  -5.324814 1.391082 0.041137
C  -5.91377 -0.938964 0.435688
C  -6.316311 0.409023 0.264946
C  5.911204 -0.245245 0.519351
C  7.196585 -1.027114 0.354902
H  1.305851 0.919438 -1.403763
H  1.443109 1.280672 0.332943
H  0.400304 -0.975914 0.868034
H  0.228191 -1.294877 -0.878419
H  2.954309 -0.712193 0.651646
H  2.799006 -1.122834 -1.078957
H  -1.087505 1.041033 0.664135
H  -1.230766 0.773843 -1.094896
H  4.04105 1.47176 0.06198
H  3.882917 1.076862 -1.699851
H  -1.973146 -1.663359 0.250273
H  -3.210917 1.831428 -0.186764
H  -4.257456 -2.346116 0.518054
H  -5.616679 2.439675 -0.09261
H  -6.666423 -1.716983 0.610365
H  -7.375309 0.683772 0.30592
H  8.026419 -0.469968 0.821873
H  7.418577 -1.215016 -0.705194
H  7.109373 -1.990375 0.888292
