program: Gaussian 09
title: 000250636
version: EM64L-G09RevD.01
frameworkgroup: C1[X(C20H13NO2)]
method: RPBEPBE
basis: SDD
operation: Freq
keyword: #p
keyword: freq=noraman
keyword: PBEPBE/SDD
title: #p freq=noraman PBEPBE/SDD
converged: YES YES NO NO
title: Mulliken charges:
elementType: O O N C C C C C C C C C C C C C C C C C C C C H H H H H H H H H H H H H
charge: -0.203878 -0.203285 0.021166 0.363036 0.015514 0.124621 0.166490 0.133354 -0.445024 -0.370395 -0.373270 -0.402368 -0.413035 0.449839 -0.253861 -0.265899 -0.236600 -0.236645 -0.523020 -0.416840 0.364583 -0.201603 -0.377525 0.236430 0.240806 0.270850 0.247569 0.250006 0.230179 0.230457 0.230704 0.231042 0.294616 0.288771 0.243240 0.289974
chargesum: 0.00000
title: Mulliken charges with hydrogens summed into heavy atoms:
elementType: O O N C C C C C C C C C C C C C C C C C C C C
charge: -0.203878 -0.203285 0.021166 0.363036 0.015514 0.124621 0.166490 0.133354 -0.208594 -0.129589 -0.102420 -0.154799 -0.163028 0.449839 -0.023682 -0.035441 -0.005895 -0.005604 -0.228405 -0.128069 0.364583 0.041637 -0.087551
polarizability: 4.13280010e+02 -1.43727789e+01 2.81122022e+02 -4.04358841e+00 6.83487564e+00 1.11602080e+02
1716.lowfreq: -0.0005 -0.0002 0.0002 2.3546 3.8655 7.1015 24.1060 38.3579 49.0285
frequency: 24.0166 38.3556 49.0280 78.6901 96.6169 127.6423 140.4001 151.9646 167.9724 206.1571 226.0619 260.1585 284.5162 329.9958 390.2525 399.2391 419.4492 426.2450 429.7994 453.2047 503.8881 509.7792 524.8688 547.8304 566.4002 589.2431 616.8316 630.8236 646.7316 672.6074 691.6389 700.7362 725.2382 740.1134 753.1940 757.6381 776.2059 782.9238 792.5784 817.8851 860.1177 878.1733 888.2247 893.9928 914.8189 948.0545 949.8897 951.5618 964.9234 985.6780 986.4540 989.1558 995.0622 1005.8954 1025.6894 1035.7347 1077.4523 1088.4045 1089.7328 1112.5233 1142.7678 1170.5915 1177.4667 1179.7848 1200.9060 1214.9998 1234.9443 1251.0110 1287.7330 1302.9801 1304.8011 1342.0913 1373.0746 1375.9958 1396.6582 1403.6561 1434.7737 1438.4357 1445.6995 1467.3155 1472.4190 1483.9268 1573.4686 1583.6569 1590.9584 1607.7705 1613.5269 1614.4402 1643.2997 3085.8729 3122.8893 3127.4873 3131.0438 3139.7751 3144.7585 3147.0897 3156.2756 3163.6847 3166.0838 3168.3137 3172.4972 3188.8681
redmass: 6.8030 5.8936 9.8450 5.3301 4.8432 6.1017 3.7474 6.3201 5.7939 4.9926 5.0698 4.3325 5.1431 4.4086 8.2644 3.7208 4.5458 3.6580 3.4231 3.5426 6.2979 5.5712 4.2859 6.6417 3.2982 6.2879 6.9612 3.5720 7.1854 5.6195 3.3478 3.7867 5.5422 1.9688 1.5946 5.9061 6.7163 1.9208 2.4795 1.4711 1.5470 1.3923 1.6261 5.3626 2.6902 1.6597 1.4310 1.5895 1.3839 1.3455 5.8366 1.3702 6.2722 1.3468 2.2650 1.9216 2.9565 1.5211 2.1098 1.7385 1.8247 1.1357 1.1363 1.1446 2.0522 5.4812 2.3078 2.2350 1.6382 1.5054 1.7689 1.9974 10.2454 8.2933 2.7901 3.3834 3.2838 2.3026 2.7871 2.6877 2.9016 3.6691 6.2620 6.3187 6.6791 6.8661 7.2959 6.9366 8.4740 1.0870 1.0862 1.0858 1.0887 1.0906 1.0942 1.0880 1.0952 1.1002 1.0940 1.0941 1.0966 1.0964
irintensity: 1.2301 0.4869 0.1825 1.0927 0.2636 4.2030 0.0624 0.7837 0.4554 0.1827 0.3691 0.3817 0.4049 0.8425 0.3546 2.0317 0.4459 0.3407 5.1685 1.3916 0.2829 0.6765 3.4063 4.4271 0.2510 15.6406 2.9746 5.9611 4.8269 10.9297 20.1832 31.5511 2.1372 73.1634 3.2581 6.1509 13.0324 96.4227 0.3328 22.6299 16.6387 1.1177 0.2429 0.3671 2.3946 6.4470 3.9020 20.7067 3.3555 0.0354 0.0647 0.4578 2.8103 1.0011 1.8554 5.0145 2.2705 19.7046 22.0638 4.6913 0.5308 1.7160 1.6734 25.9050 25.2473 280.6928 15.0643 29.1121 7.5347 1.4521 4.9415 0.2046 111.9889 5.4284 5.2457 0.2611 9.5308 36.4131 33.3448 1.4586 7.0211 77.1546 3.5014 1.5506 0.6961 20.3350 14.3034 0.7130 0.3713 8.0095 4.7058 2.6312 1.4691 5.5534 20.1972 12.8042 34.1451 43.4151 3.7506 4.5390 16.0726 5.0206
temp: 298.150 k
press: 1.00000 atm
elementType: 8 8 7 6 6 6 6 6 6 6 6 6 6 6 6 6 6 6 6 6 6 6 6 1 1 1 1 1 1 1 1 1 1 1 1 1
symmnumber: 1
zpe: 711372.8 jmol-1
zpe.correction: 0.270948 hartree
zpe.thermalcorrener: 0.288356 hartree
zpe.thermalcorrenthalpy: 0.289300 hartree
zpe.thermalcorrgfe: 0.224265 hartree
zpe.sumelectzpe: -973.511831 hartree
zpe.sumelectthermal: -973.494423 hartree
zpe.sumelectthermalent: -973.493479 hartree
zpe.sumelectthermalfe: -973.558514 hartree
dipole: 4.6733 2.0532 2.0383
dipole: 5.4964
quadrupole: -150.3224 -117.1580 -137.6466
quadrupole: -11.5194 -10.8919 -1.4351
quadrupole: -15.2801 17.8843 -2.6042 -11.5194 -10.8919 -1.4351
hfenergy: -973.782779 hartree
pointgroup: C01 [X(C20H13N1O2)]
dipole: -1.6726576 -0.8756645 1.0543125 debye
polarizability: 412.7244046|17.5252522|261.7344332|12.8299059|-53.5269999|131.5452751 unknown
InChI: InChI=1S/C20H13NO2/c22-21(23)15-7-5-6-14(12-15)13-20-18-10-3-1-8-16(18)17-9-2-4-11-19(17)20/h1-13H
charge 0 multiplicity 1
36 atoms
O  6.28366 1.49283 -0.551471
O  4.724733 2.488597 -1.884123
N  5.062039 1.735894 -0.890959
C  -0.948814 0.306041 0.00637
C  -2.310786 0.874601 -0.221099
C  -1.160871 -1.151978 0.257703
C  -3.285527 -0.159472 -0.060976
C  -2.572699 -1.419536 0.223126
C  0.191847 1.074128 -0.065519
C  -2.716764 2.192785 -0.511411
C  -0.257272 -2.226414 0.414504
C  -4.660297 0.118059 -0.191846
C  -3.070518 -2.725236 0.39738
C  1.587252 0.759664 0.293699
C  -4.098108 2.470278 -0.651372
C  -0.75987 -3.539869 0.578946
C  -5.061792 1.442398 -0.491524
C  -2.154751 -3.787644 0.585567
C  2.640428 1.358015 -0.449531
C  1.934496 -0.03937 1.424285
C  3.978172 1.110103 -0.087807
C  3.282893 -0.263298 1.775087
C  4.328937 0.301737 1.01517
H  0.054164 2.101852 -0.432639
H  -1.987182 3.002001 -0.629667
H  0.823629 -2.066523 0.38983
H  -5.410686 -0.670078 -0.066506
H  -4.1477 -2.923162 0.37317
H  -4.426785 3.489131 -0.883479
H  -0.060296 -4.374364 0.698115
H  -6.126212 1.677854 -0.600278
H  -2.524379 -4.810005 0.721669
H  2.432011 2.001059 -1.30997
H  1.136617 -0.451514 2.049354
H  3.51995 -0.871781 2.653739
H  5.382183 0.146014 1.261365
