program: Gaussian 09
title: 000254916
version: EM64L-G09RevD.01
frameworkgroup: C1[X(C7H8N6)]
method: RPBEPBE
basis: SDD
operation: Freq
keyword: #p
keyword: freq=noraman
keyword: PBEPBE/SDD
title: #p freq=noraman PBEPBE/SDD
converged: NO YES NO NO
title: Mulliken charges:
elementType: N N N N N N C C C C C C C H H H H H H H H
charge: -0.051232 0.044652 -0.029873 -0.088129 -0.611527 -0.581802 -0.116107 -0.028841 0.148875 0.223649 -0.397343 -0.033181 -0.784919 0.245891 0.245831 0.233581 0.233609 0.329175 0.351834 0.329694 0.336162
chargesum: 0.00000
title: Mulliken charges with hydrogens summed into heavy atoms:
elementType: N N N N N N C C C C C C C
charge: -0.051232 0.044652 -0.029873 -0.088129 0.069482 0.084055 -0.116107 -0.028841 0.148875 0.223649 -0.151452 -0.033181 -0.071898
polarizability: 2.01163743e+02 1.64807149e+00 1.27482179e+02 2.55576263e-02 2.55237354e-03 5.18759251e+01
1716.lowfreq: -0.0005 -0.0004 0.0006 5.7699 7.2556 12.2805 42.4385 72.0634 159.6361
frequency: 42.3173 72.0630 159.6345 187.7114 207.8103 212.0013 302.6146 349.6711 361.8789 425.7596 436.4866 476.6701 507.8577 543.5131 544.3306 552.1617 567.4309 569.6601 634.5452 637.8545 671.7339 699.1422 739.6038 814.2798 825.8213 907.4991 919.0400 940.8881 998.1137 1036.3385 1046.0016 1102.5843 1135.2289 1245.9941 1271.1686 1284.0452 1343.0825 1375.6371 1394.1327 1415.4167 1432.3632 1465.6269 1473.6599 1477.6843 1506.4589 1536.9113 1560.2156 1597.5335 1620.1342 2982.8823 3060.1544 3112.3875 3115.0511 3517.4044 3557.9506 3683.7449 3719.4720
redmass: 1.1144 3.2278 5.2760 4.8313 6.4811 3.1960 2.8011 3.0893 5.2182 5.6872 3.8390 1.1993 7.7740 1.6060 5.1801 1.3126 5.0631 1.8859 1.0749 6.2989 6.4918 8.1191 8.7481 7.5703 11.1262 3.3776 1.3603 2.6972 1.9171 3.1825 1.5606 3.3814 2.2228 4.7643 2.7344 7.0229 2.7960 8.2058 1.2667 3.7010 2.6451 1.0454 1.7598 2.4314 2.5086 4.5696 2.6881 1.8416 2.2625 1.0380 1.0974 1.0977 1.0924 1.0448 1.0440 1.1045 1.1061
irintensity: 1.1154 2.0073 6.5937 1.0286 6.5356 1.9174 14.3915 2.9349 0.0523 0.8409 6.3856 224.7233 0.0353 195.6467 2.1945 87.4502 3.0331 26.2579 64.1632 0.8239 0.2013 0.3643 24.3799 1.3245 8.1231 0.0695 7.7093 21.2910 11.4849 10.3067 8.5983 19.9084 0.5093 11.4576 6.4249 19.5451 8.1190 84.5499 11.3561 178.0488 20.0936 15.9058 50.9901 46.5144 124.8549 60.2086 262.7065 868.0300 254.3948 24.6856 17.5837 7.8541 30.6295 88.6774 161.0983 64.8580 50.2426
temp: 298.150 k
press: 1.00000 atm
elementType: 7 7 7 7 7 7 6 6 6 6 6 6 6 1 1 1 1 1 1 1 1
symmnumber: 1
zpe: 414968.8 jmol-1
zpe.correction: 0.158053 hartree
zpe.thermalcorrener: 0.169075 hartree
zpe.thermalcorrenthalpy: 0.170019 hartree
zpe.thermalcorrgfe: 0.121058 hartree
zpe.sumelectzpe: -599.157453 hartree
zpe.sumelectthermal: -599.146432 hartree
zpe.sumelectthermalent: -599.145488 hartree
zpe.sumelectthermalfe: -599.194448 hartree
dipole: -0.4292 3.4477 0.0129
dipole: 3.4744
quadrupole: -52.4914 -74.2003 -77.7554
quadrupole: 0.0685 0.0558 -0.0223
quadrupole: 15.6576 -6.0513 -9.6064 0.0685 0.0558 -0.0223
hfenergy: -599.3155066 hartree
pointgroup: C01 [X(C7H8N6)]
dipole: 0.1358898 1.3596169 -0.038366 debye
dipolederiv: 0.1168705 -0.3663544 0.0098834 0.0327227 -0.2643395 0.0004526 -0.0005121 0.0004343 -0.2423183 -0.4818771 -0.2315169 0.0055855 0.1467574 -0.1541578 -0.0032532 -0.0036837 -0.0031632 -0.2869271 -1.6751641 -0.1052889 0.0002745 0.2916913 -0.4567139 0.00573 -0.0087398 0.0037179 -0.2711556 -0.8474181 -0.5005982 0.0115364 -0.4360135 -0.9762942 0.015826 0.0092365 0.0173635 -0.2699189 -0.2604426 -0.1829977 0.0048259 -0.0644908 -1.4427078 0.0192543 0.0023809 0.0192917 -0.6666006 -1.7670395 -0.3546904 0.0083251 -0.4991662 -0.2959001 -0.0104196 0.007248 -0.0107753 -0.7088542 -0.6149007 0.4696968 -0.0124702 -0.5035666 -0.2877817 0.0098712 0.0117335 0.0104325 0.1254123 1.3229181 0.1776033 -0.0033984 0.5531667 0.0365725 0.0039439 -0.012796 0.0033272 0.1743189 0.8389001 0.2447772 -0.0054556 0.0383447 1.6854071 -0.0371651 -0.0009462 -0.0362351 0.179208 0.4211464 0.1870812 -0.0050008 0.635501 -0.2912059 0.0099787 -0.0165422 0.009504 0.0796154 0.0520694 0.1182195 -0.0026329 -0.5063025 0.4294993 -0.0120846 0.013248 -0.0113889 -0.0286411 2.2896098 0.3846432 -0.0046814 0.2285345 0.952267 -0.0178945 0.004709 -0.0174591 0.1877185 -0.2886495 -0.03994 0.0009193 -0.0108068 0.0283879 0.0005388 0.0005653 0.000499 0.0510549 -0.070511 0.0990032 -0.0026968 0.1188001 0.0320936 0.002271 -0.0030578 0.0020298 0.1173293 0.0892141 0.0440199 -0.001112 -0.0796877 -0.0950867 0.0052255 0.0019144 0.0053231 0.1169077 -0.0239765 0.0000227 -0.0701701 -0.005093 0.0854537 0.0813054 -0.1268343 0.0475387 -0.0407499 -0.0240606 0.0034952 0.0699747 0.0010968 0.0787508 -0.0872689 0.1268126 -0.0534748 -0.0340098 0.1625624 -0.0380458 0.0007334 -0.0118526 0.2679758 0.0027193 0.0000696 0.0027319 0.3814394 0.2182003 0.0261807 -0.0007957 -0.0054845 0.3024829 0.0013214 0.0000942 0.0009369 0.357093 0.3053558 0.0171647 -0.0014055 -0.0536162 0.1595523 0.0052148 -0.000194 0.005283 0.3894497 0.2371929 0.0475246 -0.0022388 0.1294651 0.2057444 0.004433 -0.0047058 0.0040829 0.3896282 unknown
polarizability: 201.2001201|0.1465501|127.3999036|0.1682645|-1.8579139|51.9218237 unknown
InChI: InChI=1S/C7H8N6/c1-3-2-10-6-4(11-3)5(8)12-7(9)13-6/h2H,8-9H2,1H3
charge 0 multiplicity 1
21 atoms
N  1.478865 0.927052 -0.036689
N  0.918401 -1.893706 0.033204
N  -1.416476 -1.425705 0.019855
N  -2.203472 0.922819 -0.038594
N  -0.660728 2.70554 -0.081883
N  -3.684483 -0.878638 -0.000438
C  0.195962 0.437604 -0.025351
C  -0.121627 -0.967632 0.008605
C  -0.927904 1.367001 -0.049338
C  2.484805 0.016418 -0.013312
C  2.16876 -1.388918 0.022147
C  -2.37725 -0.457357 -0.002711
C  3.914496 0.504176 -0.025421
H  2.984526 -2.122719 0.041326
H  3.931459 1.604866 -0.052842
H  4.46359 0.16548 0.872943
H  4.463475 0.121223 -0.905914
H  -1.425247 3.375974 -0.098884
H  0.318218 2.994038 -0.087689
H  -4.430102 -0.188741 -0.021171
H  -3.874771 -1.877077 0.020859
