program: Gaussian 09
title: 000250629
version: EM64L-G09RevD.01
frameworkgroup: C1[X(C15H12)]
method: RPBEPBE
basis: SDD
operation: Freq
keyword: #p
keyword: freq=noraman
keyword: PBEPBE/SDD
title: #p freq=noraman PBEPBE/SDD
converged: YES YES NO YES
title: Mulliken charges:
elementType: C C C C C C C C C C C C C C C H H H H H H H H H H H H
charge: 0.165484 0.140436 0.070305 0.036959 0.407514 -0.403088 -0.417989 -0.392240 -0.339570 -0.339449 -0.242402 -0.233811 -0.248649 -0.273380 -0.756276 0.245070 0.247427 0.238575 0.248079 0.235342 0.226513 0.226726 0.225460 0.225354 0.228402 0.239604 0.239605
chargesum: 0.00000
title: Mulliken charges with hydrogens summed into heavy atoms:
elementType: C C C C C C C C C C C C C C C
charge: 0.165484 0.140436 0.070305 0.036959 0.407514 -0.158018 -0.170562 -0.153665 -0.091491 -0.104107 -0.015890 -0.007085 -0.023189 -0.048026 -0.048666
polarizability: 2.35381632e+02 -7.96957704e-01 2.07509452e+02 -2.47771500e-03 2.37125249e-03 6.64071762e+01
1716.lowfreq: -9.8448 -3.7376 -0.0005 -0.0002 0.0003 4.2775 67.0769 114.0075 130.8287
frequency: 67.0756 114.0073 130.8283 160.9847 173.5178 208.2536 224.5648 295.5109 347.7626 400.4957 414.8017 428.4162 464.5809 510.0474 532.4770 569.1707 615.5310 634.1429 641.3223 710.4687 738.4810 749.8732 759.8654 781.8516 798.0151 840.5516 877.9332 883.5790 885.5195 948.1374 949.6387 982.6203 985.1838 992.9908 993.8708 1025.1439 1031.6531 1032.8091 1086.7793 1100.4338 1114.7060 1160.7198 1169.9415 1179.8741 1214.5699 1240.8641 1295.2416 1303.2395 1346.9077 1382.8918 1395.5232 1401.7993 1437.8674 1445.4168 1468.1673 1473.1857 1476.5024 1477.6061 1584.6950 1589.5958 1615.7672 1617.6859 1662.8018 2964.7872 3036.0173 3084.1468 3106.2464 3119.8566 3123.0326 3128.2369 3135.6971 3141.2569 3154.9550 3160.6662 3177.1286
redmass: 2.6457 4.4743 2.5825 1.3231 3.2993 4.4631 2.7090 3.8940 3.7382 3.2476 6.4220 3.3038 3.1373 5.2982 5.2452 3.2957 7.0291 3.3108 5.3349 5.1292 1.7633 1.4255 5.4984 1.6785 2.6537 1.4078 1.4168 4.0542 1.6529 1.4321 1.4317 1.3405 1.3257 2.6220 7.1348 2.1507 1.5231 1.9521 2.1261 2.2778 1.6736 1.5726 1.0958 1.2839 2.2458 2.1030 1.5108 1.8382 1.6964 3.7195 1.3859 2.7834 2.2970 2.8466 2.4991 1.0469 4.0402 1.1138 6.3976 6.5460 7.3097 6.9933 8.5177 1.0389 1.0965 1.0939 1.0923 1.0854 1.0857 1.0889 1.0909 1.0944 1.0969 1.1002 1.0951
irintensity: 0.0003 4.1521 0.0027 2.7166 0.1915 0.0955 0.0933 0.0634 0.6889 2.8811 0.3505 2.9608 0.2005 0.2727 0.1759 0.0001 3.2759 5.5386 1.6415 0.8607 41.1459 67.5654 1.7983 65.3219 21.6441 14.7130 0.0052 5.0951 1.4559 1.9126 4.1271 0.0015 0.0659 3.8582 4.4862 0.7798 0.0005 6.5497 5.3028 2.4873 1.7397 3.9536 0.7946 5.7674 1.8017 3.8932 2.4214 2.9695 0.5886 20.2997 3.9820 1.3441 31.1421 24.7182 5.1439 15.7762 8.2884 12.8962 0.8844 0.4666 6.1035 0.3419 16.4450 23.0907 18.6198 24.2394 23.9311 4.8394 2.0616 2.6994 9.3056 29.0362 38.5703 40.2814 20.0274
temp: 298.150 k
press: 1.00000 atm
elementType: 6 6 6 6 6 6 6 6 6 6 6 6 6 6 6 1 1 1 1 1 1 1 1 1 1 1 1
symmnumber: 1
zpe: 571076.2 jmol-1
zpe.correction: 0.217511 hartree
zpe.thermalcorrener: 0.229187 hartree
zpe.thermalcorrenthalpy: 0.230131 hartree
zpe.thermalcorrgfe: 0.179995 hartree
zpe.sumelectzpe: -577.787373 hartree
zpe.sumelectthermal: -577.775698 hartree
zpe.sumelectthermalent: -577.774754 hartree
zpe.sumelectthermalfe: -577.824890 hartree
dipole: 0.5117 0.9022 0.0001
dipole: 1.0372
quadrupole: -76.1683 -72.8971 -94.9176
quadrupole: 1.2595 -0.0001 0.0005
quadrupole: 5.1594 8.4306 -13.5899 1.2595 -0.0001 0.0005
hfenergy: -578.0048849 hartree
pointgroup: C01 [X(C15H12)]
dipole: -0.1875686 -0.3624207 0.0000345 debye
polarizability: 235.4017223|0.273457|207.4893619|0.0025668|-0.0022745|66.4071762 unknown
InChI: InChI=1S/C15H12/c1-2-11-12-7-3-5-9-14(12)15-10-6-4-8-13(11)15/h2-10H,1H3
charge 0 multiplicity 1
27 atoms
C  0.935156 0.811248 0.000222
C  -0.522593 1.039212 0.000182
C  1.164634 -0.601732 0.000277
C  -1.183746 -0.237453 0.000213
C  -0.149624 -1.308715 0.000237
C  2.015545 1.716634 0.000225
C  -1.261537 2.238026 0.00015
C  2.480003 -1.106608 0.000335
C  -2.594934 -0.291462 0.000251
C  -0.301968 -2.671017 0.000212
C  3.334743 1.203477 0.000285
C  -2.67586 2.170763 0.000161
C  3.564666 -0.196092 0.000341
C  -3.334962 0.917109 0.000218
C  -1.601857 -3.442247 0.0001
H  1.846156 2.799186 0.000184
H  -0.757204 3.210876 0.000127
H  2.674764 -2.185295 0.000374
H  -3.129153 -1.244659 0.000325
H  0.616416 -3.274449 0.000285
H  4.186998 1.892234 0.000289
H  -3.26509 3.094723 0.000139
H  4.592497 -0.575963 0.000387
H  -4.430077 0.88003 0.000243
H  -1.417765 -4.529191 -0.000262
H  -2.218003 -3.20463 -0.889495
H  -2.217805 -3.205203 0.889993
