program: Gaussian 09
title: 000250618
version: EM64L-G09RevD.01
frameworkgroup: C1[X(C18H34O4)]
method: RPBEPBE
basis: SDD
operation: Freq
keyword: #pfreq=noraman
keyword: PBEPBE/SDD
title: #p freq=noraman PBEPBE/SDD
converged: YES YES NO NO
title: Mulliken charges:
elementType: O O O O C C C C C C C C C C C C C C C C C C H H H H H H H H H H H H H H H H H H H H H H H H H H H H H H H H H H
charge: -0.272159 -0.272219 -0.244973 -0.244976 -0.383441 -0.383465 -0.369675 -0.369662 -0.379977 -0.380046 -0.519090 -0.519036 0.242664 0.242689 -0.046165 -0.046188 -0.294020 -0.293927 -0.696300 -0.687336 -0.696294 -0.687386 0.196928 0.194657 0.196932 0.194655 0.192828 0.191474 0.192842 0.191475 0.207436 0.227203 0.227276 0.207400 0.246984 0.236908 0.246993 0.236830 0.212223 0.212220 0.231178 0.215974 0.231202 0.215975 0.213162 0.220685 0.212248 0.211866 0.224408 0.214322 0.213170 0.220684 0.212245 0.211893 0.224460 0.214246
chargesum: 0.00000
title: Mulliken charges with hydrogens summed into heavy atoms:
elementType: O O O O C C C C C C C C C C C C C C C C C C
charge: -0.272159 -0.272219 -0.244973 -0.244976 0.008144 0.008121 0.014627 0.014656 0.054662 0.054630 -0.035198 -0.035213 0.242664 0.242689 0.166058 0.166032 0.153132 0.153250 -0.050204 -0.036741 -0.050195 -0.036788
polarizability: 2.93041872e+02 -1.39583546e-03 1.69392379e+02 -2.99353604e+00 -5.07120413e-02 1.76635439e+02
1716.lowfreq: -2.2815 -0.0023 0.0010 0.0019 4.8075 8.5840 10.6061 13.7111 16.1783
frequency: 8.5219 13.3824 16.1780 26.2357 31.4371 42.4711 43.0868 49.1540 55.2609 61.2293 71.6878 73.5104 91.5613 106.7147 115.0543 133.3460 144.5579 154.3041 162.1078 194.8114 196.0667 219.6389 227.6642 242.5149 243.7798 245.3716 253.2338 301.8372 304.3834 331.3240 341.5976 373.5736 391.0091 408.8072 409.1791 447.9414 450.1722 523.4066 530.9937 561.6227 568.8457 662.1106 666.5971 724.3553 726.7548 744.5050 786.9339 813.3221 813.3534 834.6913 836.2979 850.0914 897.1466 897.3508 919.3212 919.5621 922.8144 943.4891 943.9845 958.2384 959.2320 966.1578 967.1250 999.4760 999.7208 1009.5427 1047.2286 1065.3287 1080.4087 1082.0897 1092.2880 1094.4752 1101.7447 1132.5827 1135.7075 1136.0507 1140.3379 1167.4230 1167.6638 1186.1347 1186.2496 1200.7528 1212.6327 1235.4682 1249.3706 1250.4598 1251.3290 1266.8922 1281.4303 1286.1260 1287.9425 1292.1181 1292.9019 1298.6616 1302.0999 1317.3839 1340.2802 1345.0859 1346.5504 1354.5699 1358.9499 1359.4680 1365.2192 1366.2179 1377.6138 1377.6515 1395.8260 1395.9850 1442.8506 1442.9430 1458.1695 1458.2820 1463.0012 1464.1807 1467.2171 1468.6259 1468.7546 1470.7558 1470.8007 1475.0488 1481.8071 1481.8653 1483.8352 1488.8937 1488.9316 1489.8639 1643.2585 1643.3103 2951.6061 2953.3219 2955.9834 2965.3966 2972.4070 2972.4880 2976.2767 2976.4278 2978.5768 2978.6276 2987.0401 2987.1496 2987.1678 2990.3373 2991.6229 2995.3500 3009.3817 3009.4349 3011.2593 3032.2911 3042.5656 3045.5908 3064.8990 3065.0260 3066.7629 3067.5159 3072.7236 3072.7276 3078.1060 3078.1383 3081.0839 3081.1265 3085.8831 3085.9140
redmass: 3.8952 4.3270 3.5961 3.7419 5.2497 3.9615 4.3531 3.4833 2.3538 2.1957 4.1583 2.4249 2.8926 2.7534 2.0858 4.4733 2.2431 2.0527 3.0778 1.0895 1.0875 1.4909 1.2049 1.7783 2.7888 3.5832 3.5145 3.3339 3.4213 3.4772 3.2352 2.8006 2.6587 1.8720 1.8720 3.4883 3.3224 3.8107 3.3984 3.1135 3.1723 4.9261 4.6806 1.0644 1.1037 1.1946 1.3155 2.6533 2.6532 5.2801 3.8481 1.5197 1.8557 1.8306 1.1951 1.1949 1.3671 1.7404 1.6947 2.3613 2.3382 1.7378 1.8306 1.3090 4.3087 4.3572 4.3529 2.6726 2.2118 2.0986 3.7351 2.0043 1.9130 2.3616 2.3373 2.2355 2.0146 1.9229 1.9439 1.8385 1.8415 1.5376 1.3098 1.3429 1.2762 1.1971 1.2701 1.2250 1.1990 1.1419 1.1171 1.3406 1.3466 1.1049 1.1252 1.4357 1.4317 1.4223 1.4610 1.4232 1.4446 1.6825 1.5926 1.6478 1.2105 1.2107 1.2159 1.2160 1.0847 1.0846 1.0777 1.0773 1.0714 1.0695 1.0749 1.0446 1.0445 1.0682 1.0678 1.0932 1.0518 1.0518 1.0979 1.0540 1.0536 1.0992 9.1783 9.1843 1.0587 1.0589 1.0594 1.0591 1.0354 1.0354 1.0655 1.0655 1.0359 1.0359 1.0838 1.0883 1.0895 1.0680 1.0635 1.0919 1.0570 1.0570 1.1017 1.1020 1.0970 1.0987 1.1001 1.1001 1.1000 1.1002 1.1008 1.1008 1.0999 1.0999 1.0991 1.0991 1.1063 1.1064
irintensity: 0.6743 0.3140 0.5002 0.1793 0.9224 0.1966 0.7582 1.0255 0.3189 0.0632 0.7130 0.5486 0.8213 0.3715 0.3950 1.2602 0.6579 0.1329 1.6028 0.3503 0.2566 1.9707 1.8803 4.6073 0.2129 3.0108 1.3864 26.4902 0.4803 9.0584 0.0612 9.0010 1.3820 1.6675 1.7572 0.0038 3.5008 3.3057 0.8747 2.4171 2.8726 6.0323 1.7311 18.8390 0.4324 5.5170 0.9900 3.4530 7.8755 11.7183 0.0483 3.6810 1.8099 7.6342 8.0779 5.6748 0.0674 0.3212 32.7125 7.7769 115.3944 0.0837 34.7797 0.2513 0.1559 0.4122 139.2539 0.6281 1.0514 25.1750 3.1484 231.3705 1.5111 344.4250 2.1180 31.8488 6.8083 14.2044 0.0405 0.7470 3.7412 0.0783 120.2676 0.2785 0.0020 10.2445 1.0624 5.2617 37.2573 32.2096 0.5813 0.0402 3.8353 0.0014 5.7539 0.8941 19.5120 1.0537 14.9778 1.4547 14.5524 0.0185 0.6913 36.4457 22.2971 18.8436 9.9806 10.9465 21.5639 17.0135 3.7530 3.7073 0.0679 0.0103 0.0005 2.3951 2.2779 16.5720 10.9855 5.2824 12.4924 12.6324 0.0448 30.2326 11.6559 39.0041 46.4984 255.5383 8.6824 0.0224 0.0006 101.2424 40.5542 31.7674 5.4936 3.2667 17.9779 22.6467 12.9223 2.6824 19.0639 0.5874 78.5174 7.6485 48.6947 33.1146 0.3690 38.1386 1.5463 54.9221 25.5926 25.7497 1.8824 125.4162 14.7090 6.3012 58.7868 58.6642 69.2910 25.7060 40.7270 40.6138
temp: 298.150 k
press: 1.00000 atm
elementType: 8 8 8 8 6 6 6 6 6 6 6 6 6 6 6 6 6 6 6 6 6 6 1 1 1 1 1 1 1 1 1 1 1 1 1 1 1 1 1 1 1 1 1 1 1 1 1 1 1 1 1 1 1 1 1 1
symmnumber: 1
zpe: 1289437.1 jmol-1
zpe.correction: 0.491121 hartree
zpe.thermalcorrener: 0.519637 hartree
zpe.thermalcorrenthalpy: 0.520581 hartree
zpe.thermalcorrgfe: 0.424759 hartree
zpe.sumelectzpe: -1005.428536 hartree
zpe.sumelectthermal: -1005.400020 hartree
zpe.sumelectthermalent: -1005.399076 hartree
zpe.sumelectthermalfe: -1005.494898 hartree
dipole: -0.0002 -0.9061 -0.0050
dipole: 0.9061
quadrupole: -104.2038 -135.5244 -146.1899
quadrupole: 0.0655 -16.8150 0.0468
quadrupole: 24.4356 -6.8850 -17.5505 0.0655 -16.8150 0.0468
hfenergy: -1005.9196571 hartree
pointgroup: C01 [X(C18H34O4)]
dipole: -0.0000085 0.0005371 -0.356496 debye
polarizability: 292.9875214|3.9096006|176.6901479|-0.0063993|-0.0008311|169.3920204 unknown
InChI: InChI=1S/C18H34O4/c1-15(2)13-21-17(19)11-9-7-5-6-8-10-12-18(20)22-14-16(3)4/h15-16H,5-14H2,1-4H3
charge 0 multiplicity 1
56 atoms
O  6.855529 0.41053 -0.758281
O  -6.853957 -0.407019 -0.755296
O  5.891427 -1.457249 0.270128
O  -5.889782 1.455729 0.282135
C  0.65131 -0.415796 -0.328964
C  -0.649817 0.417554 -0.327892
C  1.930456 0.451127 -0.328921
C  -1.928914 -0.449445 -0.327954
C  3.225766 -0.389413 -0.330518
C  -3.224318 0.390947 -0.327052
C  4.493465 0.489881 -0.350336
C  -4.491923 -0.488517 -0.34747
C  5.77791 -0.315304 -0.231184
C  -5.77633 0.316158 -0.224572
C  9.104456 0.606469 0.292679
C  -9.103646 -0.610103 0.292232
C  8.216045 -0.199659 -0.672993
C  -8.214482 0.20273 -0.667089
C  10.552755 0.065043 0.210249
C  8.564491 0.556717 1.739068
C  -10.551883 -0.06806 0.212561
C  -8.564699 -0.570674 1.739301
H  0.661635 -1.08275 0.558168
H  0.659942 -1.081151 -1.217515
H  -0.659452 1.083346 0.56012
H  -0.659182 1.084062 -1.21557
H  1.918398 1.120056 -1.214989
H  1.921869 1.114424 0.561629
H  -1.917618 -1.117066 -1.215018
H  -1.91946 -1.114057 0.561606
H  3.231776 -1.062448 -1.210587
H  3.254663 -1.045979 0.559368
H  -3.252651 1.045879 0.564054
H  -3.23109 1.065535 -1.205931
H  4.54684 1.110814 -1.262595
H  4.469475 1.200217 0.50238
H  -4.546363 -1.10721 -1.261165
H  -4.466675 -1.200836 0.503562
H  9.102445 1.661198 -0.049879
H  -9.101442 -1.662378 -0.057787
H  8.113613 -1.250498 -0.344282
H  8.610568 -0.159802 -1.703366
H  -8.112288 1.251306 -0.331135
H  -8.60818 0.170017 -1.698036
H  10.954042 0.12453 -0.818978
H  11.22165 0.647842 0.868722
H  10.599443 -0.992072 0.535242
H  9.209599 1.145195 2.416899
H  7.542605 0.971629 1.799935
H  8.532482 -0.484499 2.111592
H  -10.952551 -0.120642 -0.817287
H  -11.221215 -0.655229 0.866695
H  -10.59873 0.986853 0.544577
H  -9.20947 -1.165138 2.412212
H  -7.542305 -0.984688 1.797604
H  -8.534325 0.467694 2.119827
