program: Gaussian 09
title: 000019444
version: EM64L-G09RevD.01
frameworkgroup: C1[X(C16H10Cl2N4)]
method: RPBEPBE
basis: SDD
operation: Freq
keyword: #p
keyword: freq=noraman
keyword: PBEPBE/SDD
title: #p freq=noraman PBEPBE/SDD
converged: YES YES NO NO
title: Mulliken charges:
elementType: Cl Cl N N N N C C C C C C C C C C C C C C C C H H H H H H H H H H
charge: -0.040736 -0.042131 -0.100087 -0.067356 0.008225 0.026887 -0.385501 0.497933 -0.137954 -0.330359 -0.433581 -0.210989 -0.197964 -0.114796 0.184971 -0.133884 -0.157804 -0.318062 -0.287828 -0.062227 -0.175828 -0.218954 0.283853 0.306941 0.270310 0.243531 0.262004 0.260535 0.283665 0.281436 0.242008 0.263744
chargesum: 0.00000
title: Mulliken charges with hydrogens summed into heavy atoms:
elementType: Cl Cl N N N N C C C C C C C C C C C C C C C C
charge: -0.040736 -0.042131 -0.100087 -0.067356 0.008225 0.026887 -0.101648 0.497933 0.168987 -0.060049 -0.190051 0.051015 0.062571 -0.114796 0.184971 -0.133884 -0.157804 -0.034397 -0.006392 -0.062227 0.066180 0.044789
polarizability: 3.14824365e+02 4.68795839e+00 1.67343990e+02 -3.23321950e+00 -4.93664155e-01 1.95694834e+02
1716.lowfreq: -4.3834 -0.0023 -0.0020 0.0006 4.5044 5.4404 11.3553 24.5952 32.5044
frequency: 10.9465 24.5858 32.4975 38.2371 51.3597 64.1083 84.6024 113.7678 120.8707 126.6400 171.9645 185.1170 195.3823 216.5827 255.9021 281.8245 300.1641 312.0424 358.2025 363.5348 383.1263 397.5007 409.9455 421.0557 439.9022 462.2996 482.5177 526.7981 566.5426 567.1521 619.7431 636.8839 670.5562 689.3432 690.2650 704.6000 732.3691 802.7527 811.3855 828.3034 832.2216 843.3343 884.3246 905.0657 931.1886 951.6424 969.3433 970.5047 982.3523 993.6720 1000.8785 1003.3859 1029.7959 1060.3105 1074.6568 1091.6237 1113.8344 1154.4838 1186.0630 1188.3108 1196.7484 1208.9217 1245.9966 1274.1352 1290.9869 1306.3243 1316.5942 1381.5402 1386.8579 1401.4017 1409.7308 1426.7486 1453.7354 1477.2659 1573.3854 1584.8163 1593.3614 1599.0014 2208.0087 2209.5268 2991.6628 2999.7142 3131.1399 3148.7345 3161.3250 3171.1435 3173.7957 3178.8706 3180.0307 3181.3275
redmass: 12.3491 6.3349 11.3190 5.0189 9.7990 7.5097 7.0941 11.6911 9.7200 10.3025 9.1625 5.1226 9.4881 9.8140 10.1463 6.7347 6.2294 6.5346 7.1097 8.2719 11.3970 6.1299 2.9677 6.0039 3.4349 8.1284 6.5103 3.6159 12.3362 5.6894 7.0422 6.4406 3.9465 3.3386 5.7923 5.3242 4.2184 1.4462 2.4840 4.5623 1.3358 2.1658 4.6917 1.4431 1.4215 1.3714 1.4376 3.3825 5.9078 1.3491 4.2512 7.5369 3.6520 1.9320 2.7845 1.4861 1.3717 1.8088 1.6100 1.1254 2.0837 1.4436 1.2562 1.3297 1.3886 1.3954 1.6122 5.6775 9.9384 2.3786 4.0219 4.7093 2.4733 2.4113 7.0666 7.3091 6.7654 6.2190 12.5673 12.5823 1.0839 1.0817 1.0902 1.0877 1.0889 1.0925 1.0953 1.0940 1.0974 1.0980
irintensity: 0.1844 1.2048 1.0167 0.0549 2.7580 2.7482 0.1190 1.0698 2.4308 2.8683 0.1258 0.1024 3.5715 0.8604 0.9824 3.6684 1.4056 3.0286 2.3562 0.3667 4.4186 14.2868 0.0272 4.1497 2.3412 7.5931 11.3903 34.8727 0.3663 2.1754 2.0794 5.1190 10.2882 33.5583 35.3658 10.7557 28.4573 37.1519 16.9024 28.7854 2.0265 41.9641 20.7646 19.4150 6.5103 0.3967 0.6893 0.2693 1.0155 0.8815 46.6034 9.3867 4.6653 14.8559 52.7432 3.3575 8.8602 96.7846 31.0228 4.1294 1.7391 15.6785 1.7430 3.0941 2.2417 4.8978 3.0504 1.5214 2.6916 6.2566 32.7670 26.5949 39.5655 90.1309 45.2737 1.9020 10.1680 20.2505 1.3195 2.1554 18.8609 2.4985 6.4414 5.6379 1.3241 0.0060 3.0955 0.5951 0.2158 8.0398
temp: 298.150 k
press: 1.00000 atm
elementType: 17 17 7 7 7 7 6 6 6 6 6 6 6 6 6 6 6 6 6 6 6 6 1 1 1 1 1 1 1 1 1 1
symmnumber: 1
zpe: 575291.3 jmol-1
zpe.correction: 0.219117 hartree
zpe.thermalcorrener: 0.239279 hartree
zpe.thermalcorrenthalpy: 0.240223 hartree
zpe.thermalcorrgfe: 0.165873 hartree
zpe.sumelectzpe: -1753.221663 hartree
zpe.sumelectthermal: -1753.201501 hartree
zpe.sumelectthermalent: -1753.200557 hartree
zpe.sumelectthermalfe: -1753.274907 hartree
dipole: -0.4959 -2.2144 -0.6292
dipole: 2.3548
quadrupole: -144.5403 -162.0458 -133.0992
quadrupole: -8.2057 20.3468 -5.8710
quadrupole: 2.0215 -15.4841 13.4626 -8.2057 20.3468 -5.8710
hfenergy: -1753.4407802 hartree
pointgroup: C01 [X(C16H10Cl2N4)]
dipole: 0.2324764 0.8856913 -0.1408385 debye
polarizability: 310.2310345|3.029277|167.3606668|23.4208033|-1.2710436|200.2714877 unknown
InChI: InChI=1S/C16H10Cl2N4/c17-13-6-4-11(5-7-13)16(12(9-19)10-20)22-21-15-3-1-2-14(18)8-15/h1-8,12,16H
charge 0 multiplicity 1
32 atoms
Cl 5.495865 2.719654 1.192324
Cl -5.802986 2.178523 -2.082728
N  -0.365222 -0.515617 -0.229358
N  -1.209045 0.01342 -1.057579
N  1.271105 -2.99401 1.976522
N  -0.519724 -3.912721 -1.958495
C  0.93194 -0.848282 -0.898495
C  2.049073 0.038789 -0.35956
C  1.218483 -2.38275 -0.624352
C  2.137138 0.364557 1.018659
C  3.018501 0.553043 -1.256109
C  3.184975 1.180759 1.495871
C  4.075079 1.366718 -0.791645
C  4.140969 1.666736 0.582794
C  -2.483963 0.368711 -0.484286
C  1.231211 -2.71636 0.818678
C  0.251774 -3.240757 -1.347696
C  -3.377555 0.990766 -1.392446
C  -2.864151 0.130105 0.864965
C  -4.647716 1.373813 -0.92925
C  -4.145227 0.522299 1.294296
C  -5.051379 1.150697 0.401991
H  0.845478 -0.72671 -1.997184
H  2.231407 -2.592859 -1.024487
H  1.384187 -0.008461 1.718703
H  2.950654 0.328452 -2.327268
H  3.254905 1.433789 2.557485
H  4.823653 1.762974 -1.483322
H  -3.060361 1.156062 -2.425714
H  -2.157339 -0.358784 1.541554
H  -4.456425 0.342525 2.328465
H  -6.047004 1.455719 0.737068
