program: Gaussian 09
title: 000256071
version: EM64L-G09RevD.01
frameworkgroup: C1[X(C6H7NS)]
method: RPBEPBE
basis: SDD
operation: Freq
keyword: #pfreq=noraman
keyword: PBEPBE/SDD
title: #p freq=noraman PBEPBE/SDD
converged: YES YES NO NO
title: Mulliken charges:
elementType: S N C C C C C C H H H H H H H
charge: -0.012262 -0.017465 0.255971 -0.830664 -0.307104 -0.170338 -0.177974 -0.354234 0.302537 0.266089 0.237271 0.240022 0.233667 0.243023 0.091461
chargesum: 0.00000
title: Mulliken charges with hydrogens summed into heavy atoms:
elementType: S N C C C C C C
charge: 0.079199 -0.017465 0.255971 -0.262038 -0.069833 0.069684 0.055693 -0.111212
polarizability: 1.11505613e+02 -4.46191828e-01 8.36325138e+01 -4.11981361e+00 -1.16776762e+00 5.27083235e+01
1716.lowfreq: -14.2302 -0.0013 -0.0005 -0.0005 5.4358 10.8937 53.7438 101.1677 161.2273
frequency: 53.6788 101.1638 161.1942 248.5361 339.9213 400.8320 472.0051 567.0847 618.2801 638.1140 748.0229 757.4222 796.6423 825.2762 898.7694 943.6988 959.9401 967.8197 1000.1687 1039.2747 1088.2375 1159.7890 1164.9200 1241.9266 1260.6631 1298.7893 1321.8999 1414.0828 1436.8611 1454.6149 1564.9078 1579.1799 2427.1909 3049.8354 3128.0144 3132.7209 3134.9020 3150.2438 3171.0664
redmass: 3.6511 5.6869 1.1362 5.5166 2.1302 3.3998 3.9524 4.4038 6.3596 4.5811 1.7644 1.1611 2.7674 3.9301 1.3197 1.8430 1.4795 3.6067 1.3436 2.3523 1.5861 1.1046 1.0732 2.0641 1.4756 1.7340 3.5694 1.9611 1.1188 2.2767 5.6992 5.8607 1.0384 1.0592 1.0874 1.0944 1.1019 1.0948 1.1014
irintensity: 0.5821 1.2655 22.4050 2.7337 8.9040 3.9075 1.3059 13.5882 3.1147 25.8128 25.1743 18.8612 15.5973 8.5165 0.1556 0.9746 0.9259 4.6445 0.0783 4.5870 8.4279 5.0461 2.1099 1.5842 0.3804 1.7326 0.7825 12.6934 10.0538 38.2901 14.3045 33.4397 31.8135 19.1447 14.5728 4.6731 0.9309 26.6114 20.5837
temp: 298.150 k
press: 1.00000 atm
elementType: 16 7 6 6 6 6 6 6 1 1 1 1 1 1 1
symmnumber: 1
zpe: 297377.8 jmol-1
zpe.correction: 0.113265 hartree
zpe.thermalcorrener: 0.120897 hartree
zpe.thermalcorrenthalpy: 0.121841 hartree
zpe.thermalcorrgfe: 0.080137 hartree
zpe.sumelectzpe: -685.049006 hartree
zpe.sumelectthermal: -685.041375 hartree
zpe.sumelectthermalent: -685.040430 hartree
zpe.sumelectthermalfe: -685.082134 hartree
dipole: 2.4513 2.8767 0.4060
dipole: 3.8012
quadrupole: -53.1453 -52.0850 -55.7949
quadrupole: -2.2346 -3.8321 -0.5686
quadrupole: 0.5298 1.5901 -2.1199 -2.2346 -3.8321 -0.5686
hfenergy: -685.1622716 hartree
pointgroup: C01 [X(C6H7N1S1)]
dipole: -0.9697395 -1.1217035 0.1948197 debye
dipolederiv: -0.3825741 0.1273954 -0.0428037 0.2037446 0.1000518 -0.0031454 0.0806953 0.0517779 -0.1892582 -0.4830469 0.0267308 -0.0166847 0.1265097 -0.3228191 -0.0155837 -0.0444583 -0.0080339 -0.2342445 0.6231733 -0.0468857 0.0203146 0.0875376 0.0963862 0.0293725 0.0476051 -0.0161082 -0.0819174 0.1673859 0.0156469 -0.075936 -0.1039191 0.0579509 0.0576641 -0.1063699 -0.0480631 0.262846 -0.3590549 -0.0412096 0.0105795 -0.2279746 -0.0113378 -0.0388452 -0.0450584 0.0032328 -0.1128964 0.172298 0.0371576 0.0482405 0.0305472 0.1697627 0.0104212 0.0642263 0.0091249 -0.0975367 -0.0024487 -0.0540132 0.0559494 0.1074185 -0.2597706 -0.0000077 0.0300514 -0.0188959 -0.1075059 0.1325113 -0.008761 0.055229 -0.2205167 0.3571463 -0.0179152 0.0306277 0.0009635 -0.0448165 0.0592512 -0.0061887 0.0187337 -0.0624251 0.0240152 -0.0768619 0.0035682 -0.0454778 0.0557892 -0.008098 -0.0123494 0.0424046 0.0515811 -0.0262789 0.1262081 0.0294902 0.068616 -0.0533491 0.050187 0.0951616 -0.0329991 0.0931954 -0.0492525 0.0195844 -0.0239062 0.0154523 0.1397807 0.0351099 -0.0838044 -0.0223053 -0.0973286 -0.0442247 -0.0182993 -0.0269402 -0.0192431 0.1423582 -0.1009194 0.019817 -0.0622243 0.0066523 0.097248 0.0016703 -0.0608785 0.0055058 0.1482623 0.0209346 0.0796304 -0.0214004 0.1137642 -0.0664433 0.0204074 -0.0269725 0.0165878 0.1285197 0.0752908 -0.1483276 0.0229021 -0.1087864 -0.1224342 -0.0946696 0.0483198 -0.0154389 0.0439685 unknown
polarizability: 111.7707571|-0.8444047|83.5465334|-0.2408428|2.1860506|52.5291596 unknown
InChI: InChI=1S/C6H7NS/c8-5-6-3-1-2-4-7-6/h1-4,8H,5H2
charge 0 multiplicity 1
15 atoms
S  3.082845 -0.012489 -0.843759
N  -0.116523 1.197598 0.219605
C  0.489378 -0.023996 0.361602
C  1.958123 -0.012851 0.70476
C  -0.219627 -1.242786 0.190872
C  -1.588509 -1.201591 -0.152684
C  -2.21453 0.055708 -0.313264
C  -1.438831 1.221085 -0.111388
H  2.220779 0.927995 1.210277
H  2.249489 -0.871165 1.329895
H  0.294711 -2.200481 0.328432
H  -2.155276 -2.128978 -0.288169
H  -3.273095 0.135573 -0.579439
H  -1.886063 2.21688 -0.212654
H  2.700731 -1.2661 -1.296783
