program: Gaussian 09
title: 000250610
version: EM64L-G09RevD.01
frameworkgroup: C1[X(C20H18N2O)]
method: RPBEPBE
basis: SDD
operation: Freq
keyword: #p
keyword: freq=noraman
keyword: PBEPBE/SDD
title: #p freq=noraman PBEPBE/SDD
converged: YES YES NO NO
title: Mulliken charges:
elementType: O N N C C C C C C C C C C C C C C C C C C C C H H H H H H H H H H H H H H H H H H
charge: -0.258691 -0.320694 -0.413161 -0.374050 0.497658 0.458510 -0.426771 -0.458070 -0.359419 -0.349546 -0.228511 -0.222176 -0.257894 -0.228968 -0.243751 -0.240912 0.197040 0.281443 -0.358258 -0.369891 -0.218812 -0.231754 -0.227449 0.196684 0.295559 0.221213 0.226905 0.302914 0.264034 0.296992 0.221391 0.225798 0.229045 0.227566 0.225744 0.229544 0.270451 0.227394 0.231950 0.228900 0.232044
chargesum: 0.00000
title: Mulliken charges with hydrogens summed into heavy atoms:
elementType: O N N C C C C C C C C C C C C C C C C C C C C
charge: -0.258691 -0.025135 -0.116169 -0.177365 0.497658 0.458510 -0.205558 -0.231165 -0.056505 -0.085512 -0.007120 0.003622 -0.028850 -0.001402 -0.018007 -0.011368 0.197040 0.281443 -0.087808 -0.142497 0.013138 -0.002854 0.004596
polarizability: 2.83943913e+02 3.31115952e+01 1.92532904e+02 -4.75083850e-01 2.11727282e+01 2.00434207e+02
1716.lowfreq: -4.9754 -0.0003 0.0007 0.0009 3.9006 5.0294 19.5703 26.9879 33.7742
frequency: 19.4965 26.9642 33.6859 47.7391 51.1011 61.9414 78.8225 113.2719 123.6468 171.1387 194.2272 210.8577 250.2832 264.7994 280.5913 324.5930 388.9248 402.3144 403.7888 407.3792 410.0391 445.6877 472.3072 486.5003 534.6957 562.6894 596.5751 613.8779 615.3194 616.5082 636.8164 668.7118 678.7759 699.8917 702.8153 709.6449 713.3236 753.0685 764.7753 790.8719 821.8820 853.6844 854.1231 856.9574 862.2512 866.1791 922.1249 933.6611 938.5034 976.9759 982.1323 984.6359 989.4028 989.7171 991.0065 997.3061 1003.2688 1014.2215 1016.8030 1023.8682 1025.9692 1038.3782 1066.5632 1078.6288 1085.1392 1098.4490 1171.5887 1172.6498 1173.4651 1185.6026 1186.1641 1189.2207 1190.6710 1198.9381 1207.0746 1255.6689 1265.3405 1297.2104 1316.0828 1332.2046 1339.5570 1383.4463 1385.0080 1386.9466 1430.0842 1438.2257 1441.0338 1442.7366 1475.3064 1479.7330 1482.9365 1506.1955 1581.8866 1593.9317 1595.5278 1609.3654 1610.0819 1613.8115 1618.4276 2850.8392 3106.9258 3114.4123 3120.5764 3123.4798 3128.0340 3132.0597 3134.5689 3140.5128 3144.8338 3144.9811 3153.9556 3157.9862 3160.1644 3166.1895 3169.6827 3417.6213 3441.3651
redmass: 5.2727 4.5399 4.0407 4.6063 4.7572 4.5036 6.1330 5.9768 4.7118 5.0512 5.0610 4.5342 4.3281 5.6621 4.5808 5.2935 5.0361 3.0457 2.8315 3.3044 2.9836 3.2549 3.5063 2.7242 2.9233 2.8079 1.6571 6.2647 6.1866 5.0156 4.7409 5.3703 5.2489 2.2484 1.8346 1.7790 1.9923 1.8090 2.1090 2.3415 3.4614 1.2652 2.3896 1.5171 1.4795 3.7248 1.4106 1.4456 1.4661 1.4044 1.4331 1.6087 4.5380 4.3591 4.6074 1.3322 1.3401 1.5719 2.6864 2.4803 2.1702 2.3452 2.4575 1.6132 1.6303 1.9036 1.0539 1.0579 1.0607 1.3447 1.1141 1.6912 1.4074 2.7479 2.2860 2.2174 2.2358 1.3475 1.3269 1.2653 1.2594 9.2402 7.0563 6.8051 1.7458 1.6582 2.0260 1.8997 2.0767 2.2691 2.2503 1.6293 6.2264 6.0315 6.1132 6.0511 6.0825 6.0673 7.7061 1.0817 1.0875 1.0873 1.0865 1.0863 1.0866 1.0874 1.0914 1.0920 1.0923 1.0960 1.0954 1.0959 1.1014 1.1009 1.1005 1.0767 1.0763
irintensity: 1.0191 0.1185 0.5144 0.4164 0.3156 0.5485 4.5317 5.6510 2.4140 1.6389 4.5603 0.4809 1.7931 1.7395 1.5410 1.4126 3.0861 1.8516 0.0590 7.8025 0.8912 11.8821 1.7678 28.7394 25.0270 94.4008 65.1057 0.5029 5.3834 5.3157 1.4723 10.9834 6.8183 19.6041 11.5376 143.2148 60.6635 47.3852 35.3706 22.5581 0.7237 0.4395 3.5268 0.1080 6.1417 10.6387 1.8109 4.8163 7.9633 0.4088 1.6655 1.0045 0.2649 0.0694 0.0650 0.2167 0.6114 21.1230 14.2106 13.0280 8.2809 2.5424 44.1174 0.3715 6.3859 13.1730 0.0407 0.0895 1.2866 14.5876 3.0768 7.2300 0.8839 13.7194 6.2778 81.5043 55.1412 15.1324 0.5632 1.1395 3.1286 0.7542 0.2912 1.2042 4.2455 14.9756 17.1649 4.7138 25.4088 25.1577 8.3655 114.9365 32.0905 0.0983 3.0456 9.7290 7.0561 6.1941 92.6774 55.8960 9.5033 8.1684 8.8098 3.7133 0.4671 2.8496 23.2442 26.4391 24.0597 11.4717 28.7783 18.9000 37.0824 19.7134 19.9484 35.5293 2.5658
temp: 298.150 k
press: 1.00000 atm
elementType: 8 7 7 6 6 6 6 6 6 6 6 6 6 6 6 6 6 6 6 6 6 6 6 1 1 1 1 1 1 1 1 1 1 1 1 1 1 1 1 1 1
symmnumber: 1
zpe: 861099.6 jmol-1
zpe.correction: 0.327976 hartree
zpe.thermalcorrener: 0.347435 hartree
zpe.thermalcorrenthalpy: 0.348379 hartree
zpe.thermalcorrgfe: 0.277156 hartree
zpe.sumelectzpe: -956.030054 hartree
zpe.sumelectthermal: -956.010594 hartree
zpe.sumelectthermalent: -956.009650 hartree
zpe.sumelectthermalfe: -956.080873 hartree
dipole: 0.1198 -1.2357 -3.9816
dipole: 4.1707
quadrupole: -115.3417 -127.4787 -130.0819
quadrupole: 5.1170 -4.8203 7.7243
quadrupole: 8.9590 -3.1779 -5.7811 5.1170 -4.8203 7.7243
hfenergy: -956.358029 hartree
pointgroup: C01 [X(C20H18N2O1)]
dipole: 0.008708 -0.0226039 1.6407017 debye
polarizability: 283.9878574|-32.5674567|181.2012927|-8.0286774|14.095224|211.7218735 unknown
InChI: InChI=1S/C20H18N2O/c23-20(18-14-8-3-9-15-18)22-21-19(16-10-4-1-5-11-16)17-12-6-2-7-13-17/h1-15,19,21-22H
charge 0 multiplicity 1
41 atoms
O  1.688962 1.007841 -1.697318
N  -0.421866 1.184139 0.19769
N  0.931672 0.971702 0.524655
C  -1.375147 0.163896 0.702554
C  -1.152984 -1.203364 0.036917
C  -2.792369 0.70227 0.460517
C  -1.540645 -2.376987 0.728799
C  -3.723557 0.779968 1.523685
C  -0.616564 -1.313266 -1.269138
C  -3.18606 1.118954 -0.837196
C  -1.410312 -3.645947 0.122437
C  -5.034886 1.257877 1.297026
C  -0.48127 -2.583306 -1.873202
C  -4.49173 1.605273 -1.062179
C  -0.880553 -3.752396 -1.184936
C  -5.421914 1.672803 0.002566
C  1.92433 0.902095 -0.459037
C  3.318598 0.686764 0.07957
C  4.255148 0.0519 -0.77582
C  3.734686 1.114312 1.368503
C  5.576051 -0.180077 -0.341041
C  5.06024 0.886069 1.80096
C  5.981346 0.231541 0.951362
H  -1.261647 0.019918 1.807156
H  -0.724176 2.150173 0.378441
H  -1.954623 -2.299023 1.742854
H  -3.424344 0.464297 2.5313
H  -0.28164 -0.407974 -1.78828
H  -2.466579 1.057588 -1.660504
H  1.177382 0.733901 1.494562
H  -1.716571 -4.546813 0.666527
H  -5.749139 1.309613 2.126455
H  -0.058319 -2.658864 -2.881444
H  -4.787275 1.925465 -2.067649
H  -0.774849 -4.735583 -1.657697
H  -6.437058 2.04497 -0.175544
H  3.924395 -0.24274 -1.777022
H  3.048477 1.665348 2.02294
H  6.290158 -0.677482 -1.006386
H  5.376648 1.228895 2.792286
H  7.008786 0.054646 1.288433
