program: Gaussian 09
title: 000250602
version: EM64L-G09RevD.01
frameworkgroup: C1[X(C8H8N2O3)]
method: RPBEPBE
basis: SDD
operation: Freq
keyword: #pfreq=noraman
keyword: PBEPBE/SDD
title: #p freq=noraman PBEPBE/SDD
converged: YES YES NO NO
title: Mulliken charges:
elementType: O O O N N C C C C C C C C H H H H H H H H
charge: -0.213145 -0.277751 -0.246116 -0.275573 -0.628159 0.239082 -0.341271 -0.317535 -0.213552 -0.213974 -0.217948 0.187341 0.254026 0.269049 0.282867 0.236519 0.237037 0.235664 0.336811 0.322503 0.344123
chargesum: 0.00000
title: Mulliken charges with hydrogens summed into heavy atoms:
elementType: O O O N N C C C C C C C C
charge: -0.213145 -0.277751 -0.246116 0.061238 0.038466 0.239082 -0.072223 -0.034668 0.022968 0.023063 0.017716 0.187341 0.254026
polarizability: 1.81165063e+02 -7.17515678e+00 1.13311199e+02 4.73855031e+00 1.75381581e+00 5.11409012e+01
1716.lowfreq: -14.1755 -8.3256 -4.8559 0.0008 0.0008 0.0012 23.3351 46.4391 52.3910
frequency: 23.3179 46.4328 52.3828 72.7728 143.6439 190.3726 258.8259 273.7763 326.1244 400.6334 413.3674 432.7357 445.3893 489.5896 503.2080 529.5604 612.5533 638.8099 661.0855 681.1079 690.4351 697.6567 789.6804 799.4781 863.6341 954.7161 955.8596 988.7310 989.7572 995.7079 1010.0758 1028.1124 1046.2358 1050.2848 1088.7320 1176.1040 1188.8917 1237.0656 1295.8870 1321.8994 1390.3386 1406.6170 1439.2328 1477.9532 1584.4014 1593.3733 1610.5636 1631.4038 1680.9387 3134.0985 3146.7275 3158.2671 3169.3459 3179.9997 3333.2648 3539.1181 3694.2052
redmass: 6.5757 6.1635 5.4431 5.8844 5.0059 5.6717 7.6001 4.6246 7.1772 2.8110 1.8724 2.1320 3.8737 1.8198 1.4888 2.3033 6.4482 4.6709 6.2388 4.3093 6.6396 1.7167 1.9886 7.7276 1.2454 1.5864 2.0630 6.4957 6.2469 1.3961 1.3355 2.3678 3.5843 2.5217 1.6413 1.0588 1.1259 3.7815 2.4156 1.3115 9.3057 1.7042 2.2408 2.2337 5.8023 1.2985 5.8807 7.1186 6.1791 1.0858 1.0892 1.0938 1.0979 1.0990 1.0756 1.0451 1.1042
irintensity: 2.4995 6.5953 6.7019 5.9675 0.5272 9.0764 7.9691 4.8758 15.0413 0.0767 37.0319 19.9305 8.7927 201.8649 134.0101 72.0431 0.4222 6.1768 16.1584 35.5402 26.9669 108.3985 26.5942 37.6476 0.0447 3.7156 34.7325 119.8564 7.2537 0.3368 0.3680 7.1985 80.2233 1.5850 7.4097 0.8303 32.2064 248.7022 128.5620 8.5100 7.4482 408.3797 10.6009 9.2624 28.8144 116.1115 8.2725 280.6640 188.2867 0.3682 9.3221 14.0803 15.9014 8.9127 67.1823 65.4482 44.7262
temp: 298.150 k
press: 1.00000 atm
elementType: 8 8 8 7 7 6 6 6 6 6 6 6 6 1 1 1 1 1 1 1 1
symmnumber: 1
zpe: 403945.9 jmol-1
zpe.correction: 0.153855 hartree
zpe.thermalcorrener: 0.165862 hartree
zpe.thermalcorrenthalpy: 0.166806 hartree
zpe.thermalcorrgfe: 0.113626 hartree
zpe.sumelectzpe: -643.859178 hartree
zpe.sumelectthermal: -643.847171 hartree
zpe.sumelectthermalent: -643.846227 hartree
zpe.sumelectthermalfe: -643.899406 hartree
dipole: 0.3316 1.5019 -0.9383
dipole: 1.8017
quadrupole: -42.0674 -77.5394 -79.5385
quadrupole: -10.6998 3.8918 1.4576
quadrupole: 24.3144 -11.1576 -13.1567 -10.6998 3.8918 1.4576
hfenergy: -644.0130325 hartree
pointgroup: C01 [X(C8H8N2O3)]
dipole: -0.1438104 0.5713856 0.3940412 debye
dipolederiv: -0.885492 0.1930995 0.0219307 0.7226639 -0.4470704 0.0841764 -0.3778355 0.0921961 -0.1227526 -0.740384 -0.2530698 0.0376468 -0.0029013 -0.9685252 0.1011226 -0.0361131 0.0820786 -0.3374806 -0.6964252 -0.0543593 -0.0281535 0.1580817 -0.8923348 -0.3139369 0.0299895 -0.2826718 -0.4912798 -0.7349411 0.1916016 0.0269963 0.5960173 -0.3553835 -0.2964237 0.496964 -0.3100303 -0.5327501 -1.4364191 -0.2296754 -0.0969837 -0.2976728 -0.6427334 0.2374583 0.0178506 0.2354658 -0.5085506 -0.5691145 -0.2072754 -0.0058374 -0.1711652 -0.1275317 0.001976 0.0145578 -0.0018978 -0.0091001 0.104497 0.1683263 -0.0041425 -0.1263679 0.0290369 -0.015676 0.0393993 -0.0037406 -0.1099224 0.0787185 -0.0642171 0.0267761 0.1621804 0.0017639 -0.0021862 -0.0163932 -0.0147545 -0.0967461 0.0014389 -0.1936209 0.0408306 -0.2223521 -0.1076027 -0.0193739 0.0321204 -0.0221249 -0.1481942 -0.2393756 0.0631662 -0.0130272 0.0816812 0.1579347 -0.0295342 -0.0174097 -0.0273843 -0.1496377 0.1101592 0.0439434 0.0193989 0.0522462 0.0589612 -0.0198484 0.0163502 -0.0177506 -0.124708 1.8943925 0.2037877 0.0744702 -0.3750921 1.2595229 -0.1834147 0.2674336 -0.1709499 0.2921393 2.3425397 0.1201722 -0.139924 -0.4779346 1.2840045 0.5706308 -0.3946841 0.4991262 0.6288032 0.12761 -0.0388668 -0.0017038 -0.0074412 -0.0162239 0.0194871 -0.002315 0.0171342 0.1563011 0.0579944 0.0628584 -0.0164937 0.0719973 0.0763572 0.0105222 -0.0135941 0.0123039 0.1554972 -0.0549121 0.0838976 -0.0267615 0.0968197 0.019473 0.0252626 -0.0308633 0.0236209 0.1556662 0.0714844 -0.0243569 -0.0028485 -0.0503714 -0.0984392 0.0272843 -0.0009784 0.0263118 0.1559333 -0.0906996 -0.0742129 -0.0117912 -0.0764881 0.0664955 0.0042061 -0.0126262 0.0039668 0.1556148 0.1926166 0.0437509 0.0450814 -0.1358955 0.1920139 0.0353969 0.003242 0.1067829 0.3387304 0.2409201 -0.0256998 0.0388756 0.0324708 0.2631722 -0.1278218 0.0133524 -0.1438707 0.2709636 0.2253919 -0.0092496 0.0156603 -0.0304762 0.2471088 -0.1093074 -0.0284474 -0.1038117 0.3214732 unknown
polarizability: 180.728168|9.3436407|113.9228323|2.7870781|0.6518174|50.9661626 unknown
InChI: InChI=1S/C8H8N2O3/c9-8(12)10-13-7(11)6-4-2-1-3-5-6/h1-5,10H,9H2
charge 0 multiplicity 1
21 atoms
O  1.110294 -0.110952 0.421068
O  0.415166 2.05455 -0.095471
O  3.186324 -1.403018 -0.789502
N  2.436886 0.48099 0.47593
N  4.669054 0.285428 -0.115677
C  -1.232971 0.237029 0.062494
C  -2.346304 1.095119 -0.139942
C  -1.42491 -1.163076 0.208693
C  -3.646807 0.554582 -0.190357
C  -2.729365 -1.694934 0.156282
C  -3.840372 -0.839878 -0.041427
C  0.113621 0.849068 0.097797
C  3.414263 -0.31141 -0.212522
H  -2.172302 2.170002 -0.25506
H  -0.55889 -1.815068 0.35312
H  -4.506655 1.214726 -0.345416
H  -2.880928 -2.773851 0.265646
H  -4.852104 -1.258529 -0.081967
H  2.360198 1.494629 0.266454
H  4.872029 1.022146 0.557305
H  5.437973 -0.17955 -0.592446
