program: Gaussian 09
title: 000250600
version: EM64L-G09RevD.01
frameworkgroup: C1[X(C18H28O4S)]
method: RPBEPBE
basis: SDD
operation: Freq
keyword: #p
keyword: freq=noraman
keyword: PBEPBE/SDD
title: #p freq=noraman PBEPBE/SDD
converged: YES YES NO NO
title: Mulliken charges:
elementType: S O O O O C C C C C C C C C C C C C C C C C C H H H H H H H H H H H H H H H H H H H H H H H H H H H H
charge: 0.139146 -0.274473 -0.263411 -0.280111 -0.300237 -0.369132 -0.551409 0.555871 -0.662003 -0.521566 -0.712762 -0.409781 0.200174 0.155432 -0.168008 -0.345762 -0.374753 -0.233459 -0.344757 -0.290197 -0.289989 -0.250445 -0.684703 0.262803 0.231828 0.205335 0.238953 0.207698 0.225780 0.270746 0.256825 0.267571 0.234460 0.204800 0.220204 0.247881 0.205748 0.204083 0.181930 0.190414 0.192928 0.194316 0.204318 0.222412 0.225329 0.205627 0.302139 0.230545 0.211781 0.217337 0.212545
chargesum: 0.00000
title: Mulliken charges with hydrogens summed into heavy atoms:
elementType: S O O O O C C C C C C C C C C C C C C C C C C
charge: 0.139146 -0.274473 -0.263411 -0.280111 -0.300237 -0.106329 -0.114247 0.555871 0.010428 -0.250819 -0.188366 -0.175321 0.200174 0.155432 0.256997 -0.097881 0.035078 0.138885 0.042487 0.136533 0.140967 0.282238 -0.043040
polarizability: 3.02600046e+02 -1.30198830e+01 1.86861420e+02 8.52663530e+00 7.72833874e+00 1.86396491e+02
1716.lowfreq: -9.0521 -6.6287 -2.9304 -0.0008 -0.0005 0.0011 6.4377 14.1280 26.0124
frequency: 4.2248 13.9033 25.5545 30.4240 38.8410 44.3739 50.9244 60.9682 65.6449 82.3205 95.8797 102.6500 108.5579 145.8660 150.0401 159.6041 186.2533 205.2856 215.8942 221.0739 230.8746 243.3875 253.6797 275.6402 297.0438 308.5637 311.4901 340.0796 375.1802 382.7599 399.0098 417.9078 429.5371 449.1081 518.4670 539.8725 574.0835 593.9508 632.4566 674.1920 704.6356 714.4470 741.5000 749.9282 773.5360 775.8692 798.4859 805.0712 810.3678 827.0962 862.5724 869.6309 879.3229 891.0290 903.1330 910.4084 922.6164 927.8174 934.4195 964.2654 995.2574 1012.7342 1020.4638 1024.0885 1031.7729 1057.2923 1062.4322 1077.8618 1081.9458 1082.7909 1085.1493 1103.6230 1113.3421 1127.6257 1137.0380 1149.2355 1150.3072 1159.4417 1169.7952 1186.0761 1208.7425 1222.7207 1237.3581 1250.6829 1261.1654 1267.4872 1267.7370 1270.9598 1272.3311 1277.6196 1280.9271 1282.3124 1322.2084 1325.5231 1344.1865 1375.0712 1376.3070 1380.6516 1382.8557 1391.0569 1391.8336 1398.0465 1437.5938 1446.5317 1458.0733 1459.2280 1466.0741 1469.1394 1470.5567 1474.5600 1475.2735 1476.4540 1477.7603 1478.5224 1483.8365 1491.6644 1496.7848 1607.9848 1622.8905 2923.8740 2952.5934 2958.6760 2966.6434 2970.7682 2971.9392 2975.4176 2976.7431 2977.9189 2987.1335 3003.0185 3009.6883 3019.2999 3021.2192 3032.3724 3043.7404 3051.6235 3057.4215 3067.2207 3073.1855 3075.5673 3081.3475 3097.0297 3107.4982 3111.9695 3129.1783 3170.6564 3176.8887
redmass: 4.2572 3.2531 2.5997 3.6601 5.2493 3.3762 6.5563 4.2335 3.3423 3.7526 2.5284 2.1989 2.3625 2.9869 2.6507 4.5895 3.9011 2.8676 1.5039 4.9473 1.1342 2.3750 3.9412 3.9662 3.4189 3.9001 2.4944 3.3560 4.5115 3.5206 3.5039 3.9203 2.9424 3.3094 5.1201 4.5606 3.6361 5.2744 4.9993 9.5007 5.6644 4.5397 1.0736 4.2354 1.2581 4.2854 1.2064 1.1388 1.5514 6.3842 1.6569 4.3674 1.8094 3.9842 1.8171 1.9573 2.8431 1.3524 1.1521 5.0927 1.3662 4.7048 6.2944 1.6294 4.3115 4.4572 3.4363 2.7319 2.1879 3.7451 1.4558 1.7798 2.2199 1.4721 1.6916 1.4407 1.1431 1.2629 1.1859 1.6743 1.3746 1.1906 1.2358 2.5200 1.5561 1.2520 1.3109 1.1735 1.1982 1.3097 1.1032 1.1408 1.4615 1.1968 1.4898 1.2463 1.3156 1.3093 1.3229 1.2025 1.2270 3.5797 4.3471 1.0951 1.0811 1.0849 1.0642 1.0910 1.0719 1.0716 1.0606 1.2416 1.0457 2.0086 1.0716 1.1014 1.1708 7.7161 8.1321 1.0562 1.0643 1.0572 1.0590 1.0647 1.0495 1.0367 1.0500 1.1036 1.0591 1.0593 1.1006 1.1057 1.0878 1.0583 1.0978 1.1043 1.0960 1.0975 1.1011 1.0994 1.1009 1.0992 1.1069 1.1150 1.0897 1.0932 1.0953
irintensity: 0.2526 0.0973 0.8401 0.5090 0.5177 0.2879 1.0287 0.2817 0.1356 0.2293 0.4172 0.0922 2.0384 5.7356 14.6042 6.7574 6.0578 0.6277 0.1824 0.8553 0.0173 0.6042 0.0863 25.5828 0.5228 1.0409 1.4724 7.3947 1.0359 3.3822 2.9168 4.2958 6.1207 5.8970 3.9715 0.3563 1.3216 5.3244 11.0267 0.0743 13.6044 3.8895 8.4772 9.3068 3.3992 10.5396 5.0712 0.2754 41.9875 27.4192 14.4057 20.5519 2.7292 17.2692 5.0522 5.8186 2.9591 0.7108 0.6841 107.3303 22.0892 1.9040 186.3129 11.1497 41.6367 85.6323 13.4329 7.6915 5.1852 23.7479 5.6584 18.3552 1.5534 4.0349 1.3757 4.5308 2.0235 5.2841 0.9821 50.2264 1.5052 14.7275 8.5993 104.3603 63.8395 0.4254 9.5608 0.3915 0.3765 5.0785 2.2770 4.8050 1.8549 2.6444 0.4459 6.2193 15.2557 4.5240 5.8087 15.7216 6.4745 10.9357 38.9263 8.6740 2.2630 2.2186 19.7543 4.9002 0.7842 1.9096 10.5058 30.0442 11.2379 115.7072 10.3479 6.9647 15.0565 5.0450 0.2832 49.3495 13.4339 24.7606 29.0051 73.6217 2.9705 33.6999 79.6157 41.5508 43.5728 42.3451 4.1500 19.9271 5.6445 21.3620 9.1620 34.3011 4.9176 34.3742 93.6759 52.1946 64.7563 24.3561 11.8810 30.4570 11.4946 2.4102 4.2033
temp: 298.150 k
press: 1.00000 atm
elementType: 16 8 8 8 8 6 6 6 6 6 6 6 6 6 6 6 6 6 6 6 6 6 6 1 1 1 1 1 1 1 1 1 1 1 1 1 1 1 1 1 1 1 1 1 1 1 1 1 1 1 1
symmnumber: 1
zpe: 1124019.2 jmol-1
zpe.correction: 0.428116 hartree
zpe.thermalcorrener: 0.454444 hartree
zpe.thermalcorrenthalpy: 0.455388 hartree
zpe.thermalcorrgfe: 0.365676 hartree
zpe.sumelectzpe: -1399.801777 hartree
zpe.sumelectthermal: -1399.775450 hartree
zpe.sumelectthermalent: -1399.774505 hartree
zpe.sumelectthermalfe: -1399.864217 hartree
dipole: -1.3988 -0.2927 1.9627
dipole: 2.4279
quadrupole: -129.8833 -154.8039 -146.3654
quadrupole: 7.9214 6.4445 0.2185
quadrupole: 13.8009 -11.1196 -2.6812 7.9214 6.4445 0.2185
hfenergy: -1400.2298931 hartree
pointgroup: C01 [X(C18H28O4S1)]
dipole: 0.5607884 -0.2987199 -0.7132241 debye
polarizability: 301.8911864|17.2142122|183.6331536|5.6994019|-6.6178675|190.3336166 unknown
InChI: InChI=1S/C18H28O4S/c1-3-4-7-19-8-9-20-10-11-23-15(2)12-16-5-6-17-18(13-16)22-14-21-17/h5-6,13,15H,3-4,7-12,14H2,1-2H3
charge 0 multiplicity 1
51 atoms
S  -4.077215 -1.566432 1.238137
O  0.184961 2.200145 1.28023
O  1.109212 2.266799 -0.93753
O  -0.261095 -2.828579 0.266148
O  2.832087 -0.705368 0.83136
C  -4.645865 -0.752846 -0.411615
C  -4.401586 0.785393 -0.39267
C  -2.948782 1.200302 -0.570182
C  -6.13155 -1.094033 -0.631116
C  -2.139475 1.529936 0.55831
C  -2.643176 -2.667932 0.678401
C  -2.384469 1.233095 -1.87294
C  -0.799072 1.846659 0.323957
C  -0.249689 1.872389 -0.976886
C  -1.348475 -1.869085 0.54176
C  -1.022731 1.57453 -2.101998
C  5.157254 -0.357405 0.212273
C  4.009632 -1.371077 0.24461
C  6.44935 -0.951795 -0.396469
C  1.002397 -2.165177 -0.085189
C  1.732522 -1.623138 1.167722
C  1.465942 2.283556 0.512709
C  7.609132 0.066557 -0.429744
H  -4.02173 -1.220501 -1.195533
H  -4.814463 1.193007 0.549041
H  -5.005541 1.216352 -1.217489
H  -6.290398 -2.185302 -0.64325
H  -6.487112 -0.673517 -1.592198
H  -6.756894 -0.670963 0.176543
H  -2.550347 1.506872 1.570917
H  -2.918769 -3.167872 -0.265006
H  -2.545334 -3.434693 1.465195
H  -3.018661 0.993431 -2.734791
H  -1.158993 -1.307622 1.478924
H  -1.420006 -1.138073 -0.289605
H  -0.5991 1.610497 -3.10897
H  5.352317 -0.004469 1.243488
H  4.838772 0.525267 -0.376649
H  4.280435 -2.254494 0.865849
H  3.779392 -1.72712 -0.782529
H  6.75656 -1.842766 0.188455
H  6.241939 -1.309502 -1.425663
H  0.824006 -1.325904 -0.792271
H  1.599045 -2.941858 -0.593711
H  1.040957 -1.01651 1.776515
H  2.107805 -2.463167 1.789229
H  2.083046 1.394301 0.736658
H  1.950621 3.244384 0.744806
H  7.859533 0.415675 0.589487
H  8.521468 -0.376078 -0.869442
H  7.339643 0.954529 -1.031778
