program: Gaussian 09
title: 000256077
version: EM64L-G09RevD.01
frameworkgroup: C1[X(C12H15NO4)]
method: RPBEPBE
basis: SDD
operation: Freq
keyword: #p
keyword: freq=noraman
keyword: PBEPBE/SDD
title: #p freq=noraman PBEPBE/SDD
converged: YES YES NO NO
title: Mulliken charges:
elementType: O O O O N C C C C C C C C C C C C H H H H H H H H H H H H H H H
charge: -0.272236 -0.265679 -0.251829 -0.249181 -0.468308 0.568601 -0.523050 -0.643120 0.397194 0.382722 -0.539839 -0.623518 0.181129 0.281733 -0.767535 -0.534741 -0.535347 0.326562 0.259278 0.367193 0.255323 0.270755 0.263461 0.250775 0.261630 0.244732 0.218244 0.245946 0.218381 0.216846 0.247162 0.216717
chargesum: 0.00000
title: Mulliken charges with hydrogens summed into heavy atoms:
elementType: O O O O N C C C C C C C C C C C C
charge: -0.272236 -0.265679 -0.251829 -0.249181 -0.101115 0.568601 -0.196489 -0.383842 0.397194 0.382722 -0.284516 -0.089303 0.181129 0.281733 -0.010398 0.147830 0.145378
polarizability: 2.32764174e+02 -7.03117635e+00 1.70976844e+02 -2.15868795e+00 -7.83901729e-01 8.35657299e+01
1716.lowfreq: -2.9805 -1.9637 -1.6070 -0.0007 -0.0007 0.0006 26.5997 41.1982 60.9849
frequency: 26.5541 41.1305 60.9719 73.9952 83.3369 88.9717 119.3438 151.5383 156.5454 174.9337 179.9488 220.1597 254.7545 258.1055 261.6572 276.4263 287.3287 303.7074 366.2292 431.7410 452.6874 473.2818 494.9035 540.0485 551.6352 579.8096 598.1291 600.5991 623.2672 692.4226 739.5652 801.5648 814.6636 838.3341 866.9120 891.1170 897.3296 906.9443 922.5793 942.3379 975.3164 984.8944 1022.6077 1041.0009 1051.5115 1111.2012 1111.9050 1137.2985 1147.7146 1156.0245 1163.1318 1165.8976 1187.8514 1227.9779 1266.6251 1310.8031 1321.6490 1375.1564 1403.8855 1418.6776 1428.1554 1437.9516 1441.4464 1449.6326 1452.1534 1465.3419 1465.5098 1467.6785 1474.7254 1477.6485 1555.8684 1598.9971 1609.3672 1628.4761 1644.1730 2953.3631 2955.6104 2975.1934 2982.4459 3039.2480 3041.7838 3064.3793 3087.2464 3122.0636 3122.3889 3127.8262 3158.1842 3183.4981 3208.7172 3309.5588
redmass: 4.0304 4.5251 3.6068 4.4994 3.3105 3.4887 4.5741 1.2705 3.1509 4.2920 1.8053 1.4995 4.5161 3.0935 2.1751 2.2585 3.3587 3.8927 3.8342 4.8881 2.7127 5.5929 4.8382 4.5775 3.7359 4.5654 4.2098 4.2943 3.8728 1.7091 4.9763 1.6068 2.0805 1.7775 2.4985 2.8173 1.7281 1.6092 4.1966 4.4311 3.4980 2.9147 1.8096 3.1303 2.9838 1.2593 1.2587 1.7603 1.6357 1.4525 1.6071 1.5268 1.8803 3.0868 1.3392 1.8545 3.9630 1.2509 7.4746 1.1039 1.3964 1.4082 1.0854 1.7473 1.0544 1.4520 1.2990 1.0511 1.0883 1.3976 2.3101 5.4978 7.0188 6.5864 3.3707 1.0332 1.0332 1.0664 1.0390 1.1037 1.1038 1.0955 1.0917 1.0989 1.0989 1.1003 1.0925 1.0900 1.0929 1.0805
irintensity: 1.5470 2.5977 12.6844 0.5041 0.8085 8.3023 11.7471 2.3171 0.9140 6.5883 1.5520 0.0823 0.5457 2.5211 1.2054 4.4251 7.4622 4.3105 2.0859 0.2793 2.3547 3.6765 14.0298 37.2480 2.4875 10.4420 1.6160 0.0677 1.1083 27.6517 8.2319 18.7641 5.0297 0.4685 22.8746 34.1341 10.4114 117.5609 5.7219 20.5711 17.5647 28.2292 23.7861 58.7717 62.5420 0.1578 0.5111 15.7222 71.1993 34.8388 42.7172 29.4507 16.9739 326.7603 45.4296 54.2809 97.5880 79.6838 5.1602 63.9390 69.9312 6.8774 15.3682 51.1985 20.5177 43.3154 31.2354 25.3942 16.1068 116.3370 477.1300 210.7259 338.4972 160.5887 116.7074 30.4571 106.5265 1.3066 1.3442 42.5334 61.3417 8.0421 7.6624 45.8789 2.9872 10.9034 1.1694 5.2996 13.1893 288.2933
temp: 298.150 k
press: 1.00000 atm
elementType: 8 8 8 8 7 6 6 6 6 6 6 6 6 6 6 6 6 1 1 1 1 1 1 1 1 1 1 1 1 1 1 1
symmnumber: 1
zpe: 661267.4 jmol-1
zpe.correction: 0.251863 hartree
zpe.thermalcorrener: 0.269600 hartree
zpe.thermalcorrenthalpy: 0.270544 hartree
zpe.thermalcorrgfe: 0.205006 hartree
zpe.sumelectzpe: -820.637023 hartree
zpe.sumelectthermal: -820.619287 hartree
zpe.sumelectthermalent: -820.618342 hartree
zpe.sumelectthermalfe: -820.683881 hartree
dipole: -0.3070 1.5383 0.0922
dipole: 1.5714
quadrupole: -46.9757 -113.2836 -100.8334
quadrupole: -2.2613 -1.4054 -0.1750
quadrupole: 40.0552 -26.2527 -13.8025 -2.2613 -1.4054 -0.1750
hfenergy: -820.8888864 hartree
pointgroup: C01 [X(C12H15N1O4)]
dipole: -0.1708723 0.5776332 0.1390564 debye
polarizability: 232.4533429|0.4458339|168.4622936|-12.857498|12.1725846|86.3911112 unknown
InChI: InChI=1S/C12H15NO4/c1-8(14)4-12(15)13-9-5-10(16-2)7-11(6-9)17-3/h5-7,13H,4H2,1-3H3
charge 0 multiplicity 1
32 atoms
O  -2.859768 2.405715 0.41142
O  -2.676567 -2.530572 -0.1259
O  2.05498 -2.001522 -0.69378
O  3.357008 2.030922 0.014983
N  1.320071 0.224317 -0.417455
C  -0.082152 0.068153 -0.226149
C  -0.726055 -1.191242 -0.264041
C  -0.8239 1.25529 0.003281
C  -2.217281 1.173884 0.192614
C  -2.124248 -1.239446 -0.070467
C  -2.894297 -0.071633 0.159811
C  3.712469 -0.226169 -0.860148
C  2.270862 -0.754686 -0.630649
C  4.14857 1.054424 -0.146645
C  5.580125 1.108808 0.34899
C  -4.308186 2.391706 0.613597
C  -4.1200 -2.665839 0.064407
H  -0.163833 -2.109156 -0.435083
H  -0.340286 2.236408 0.038263
H  1.701475 1.183802 -0.339093
H  -3.974465 -0.127486 0.307565
H  3.810905 -0.037585 -1.951044
H  4.395881 -1.058877 -0.627653
H  5.708652 0.395164 1.186177
H  5.830127 2.122513 0.69674
H  6.283663 0.795958 -0.444843
H  -4.83688 1.988806 -0.272735
H  -4.587125 3.445366 0.761932
H  -4.586325 1.804213 1.510773
H  -4.432754 -2.307457 1.065194
H  -4.319932 -3.744206 -0.019736
H  -4.685135 -2.121471 -0.718027
