program: Gaussian 09
title: 000256110
version: EM64L-G09RevD.01
frameworkgroup: C1[X(C13H21N3OS)]
method: RPBEPBE
basis: SDD
operation: Freq
keyword: #p
keyword: freq=noraman
keyword: PBEPBE/SDD
title: #p freq=noraman PBEPBE/SDD
converged: YES YES NO NO
title: Mulliken charges:
elementType: S O N N N C C C C C C C C C C C C C H H H H H H H H H H H H H H H H H H H H H
charge: 0.107188 -0.148560 -0.351624 0.009702 -0.080433 -0.380630 -0.371775 -0.368800 -0.352478 -0.305684 -0.356448 -0.703632 -0.696203 -0.033852 0.057247 -0.256831 -0.269105 -0.163061 0.197273 0.192001 0.191374 0.188707 0.189085 0.201289 0.187408 0.189009 0.207066 0.235315 0.194458 0.195542 0.294146 0.264081 0.210125 0.215057 0.209468 0.355592 0.254731 0.252743 0.240510
chargesum: 0.00000
title: Mulliken charges with hydrogens summed into heavy atoms:
elementType: S O N N N C C C C C C C C C C C C C
charge: 0.107188 -0.148560 0.003967 0.009702 -0.080433 0.008644 0.008307 0.021573 0.023939 0.136697 0.033552 -0.145405 -0.061552 -0.033852 0.057247 -0.002100 -0.016362 0.077449
polarizability: 2.69453674e+02 3.71038741e+01 1.80186198e+02 1.78441373e+01 -1.63578211e+01 1.31895871e+02
1716.lowfreq: -12.5271 -6.8821 -0.0025 -0.0019 -0.0013 1.8205 8.8677 12.0962 22.2596
frequency: 7.2432 11.2643 21.5794 39.6298 49.0728 53.3680 79.7185 84.1206 91.2943 110.5641 136.0532 142.0980 146.2420 176.0820 200.2512 227.9857 230.9769 263.6199 277.3503 348.7980 365.2786 399.2554 431.6068 449.5817 475.7621 508.1218 603.7553 617.8717 619.0560 685.9579 711.2925 722.6907 727.1681 737.8397 779.4227 792.8961 802.9835 812.7786 845.5752 860.7223 888.1660 926.8876 942.5351 958.6780 979.8085 987.2409 1003.0579 1016.0820 1039.1568 1050.7475 1067.7957 1075.3304 1080.4119 1085.0670 1095.8556 1103.6890 1119.1576 1187.3569 1211.4962 1213.5859 1224.2499 1248.1540 1262.0921 1263.5119 1280.9607 1282.2787 1287.8940 1294.7359 1299.8403 1317.2818 1341.5544 1343.3915 1351.9483 1352.6578 1387.8180 1388.7291 1423.8741 1427.3629 1461.2099 1462.1514 1464.9364 1469.9129 1476.6748 1477.1289 1483.8982 1488.3326 1488.4981 1532.0958 1550.4751 1674.5307 2951.0408 2953.2711 2956.4283 2963.2418 2968.7214 2971.4170 2985.9142 2989.3438 2995.3330 3007.1607 3022.6775 3023.7260 3038.1851 3054.2111 3067.9981 3070.1530 3101.7541 3142.5034 3145.2155 3189.0319 3505.1911
redmass: 4.9317 4.6912 1.7152 3.7961 6.1678 5.0594 5.2103 1.7167 3.4032 3.3994 1.9103 2.3822 3.4971 4.4875 5.2664 1.1536 3.8340 4.4849 3.6779 9.2742 4.0835 4.1038 3.4264 8.0180 3.1515 2.6508 8.5495 9.1697 8.2761 5.6433 1.2502 1.0649 1.0767 1.1260 1.1965 2.3813 8.3190 1.8939 1.2724 5.8716 1.8898 1.2359 8.7839 1.3760 1.4491 4.9290 1.1491 3.8358 3.3924 2.9749 2.9110 2.4687 2.1857 1.6064 1.4532 2.1356 2.6114 1.7497 1.2568 2.5558 1.4174 1.2597 1.2715 3.3023 1.0259 1.2552 1.1558 1.0895 1.1161 1.3339 1.4619 1.8977 1.5973 1.6181 1.5971 1.2166 1.7880 1.4085 1.0732 1.0697 1.0695 1.0798 1.0443 1.0780 1.0869 1.6830 1.3904 3.7303 4.7439 8.5660 1.0587 1.0586 1.0590 1.0592 1.0583 1.0369 1.0959 1.0628 1.0969 1.1015 1.0672 1.0935 1.1044 1.1038 1.1007 1.0992 1.1071 1.0904 1.0930 1.0993 1.0763
irintensity: 0.3405 0.4512 0.1538 0.5460 3.0340 0.0212 0.1099 0.1906 0.4471 1.4096 0.3478 0.2265 0.5753 0.1949 8.8838 0.6587 13.8572 0.3401 1.1574 2.4707 1.8647 0.0530 1.7721 20.1650 1.1567 11.6583 42.8147 0.9390 6.1337 38.3979 75.6925 11.1450 7.4199 3.1630 1.2062 0.6810 125.6245 83.0567 4.2180 16.1815 6.2491 0.4247 3.0554 0.0373 0.5137 0.4682 0.3693 1.9492 1.4550 47.2609 4.9064 0.2133 0.5465 0.1825 80.8456 212.0221 10.1437 0.4493 7.9919 14.5140 0.5791 4.6032 0.0308 3.7006 0.5558 8.7559 0.7210 0.7780 0.1900 8.5055 8.4222 8.8277 0.1227 0.7275 22.0881 11.2280 339.8789 121.5356 0.1484 0.2792 0.7372 2.1838 11.7226 1.6939 4.4629 441.2142 390.1093 264.1620 88.7372 145.0193 0.1037 3.0786 0.8917 23.0168 152.4449 34.5337 0.0080 26.9582 2.7784 1.4069 19.1696 6.5761 82.1880 70.3327 98.7843 56.5544 10.8570 16.1633 17.5817 15.8072 46.1979
temp: 298.150 k
press: 1.00000 atm
elementType: 16 8 7 7 7 6 6 6 6 6 6 6 6 6 6 6 6 6 1 1 1 1 1 1 1 1 1 1 1 1 1 1 1 1 1 1 1 1 1
symmnumber: 1
zpe: 852876.0 jmol-1
zpe.correction: 0.324843 hartree
zpe.thermalcorrener: 0.345374 hartree
zpe.thermalcorrenthalpy: 0.346318 hartree
zpe.thermalcorrgfe: 0.269117 hartree
zpe.sumelectzpe: -1144.138099 hartree
zpe.sumelectthermal: -1144.117569 hartree
zpe.sumelectthermalent: -1144.116625 hartree
zpe.sumelectthermalfe: -1144.193825 hartree
dipole: -1.6425 -0.8442 -0.9181
dipole: 2.0624
quadrupole: -87.8212 -111.5594 -120.2826
quadrupole: 15.5571 3.1163 0.5029
quadrupole: 18.7332 -5.0050 -13.7282 15.5571 3.1163 0.5029
hfenergy: -1144.4629423 hartree
pointgroup: C01 [X(C13H21N3O1S1)]
dipole: -0.6377488 0.301317 -0.4010833 debye
polarizability: 268.4573432|-12.8765624|140.5429468|41.0123992|23.5420282|172.5354529 unknown
InChI: InChI=1S/C13H21N3OS/c1-2-3-4-5-6-7-11-18-13(17)16-12-14-9-8-10-15-12/h8-10,16H,2-7,11H2,1H3
charge 0 multiplicity 1
39 atoms
S  -0.811018 0.781372 2.490666
O  -1.119577 -1.014766 0.398006
N  -2.883234 0.524557 0.796221
N  -3.676466 -0.815717 -1.035697
N  -4.957482 1.045224 -0.086343
C  4.180082 0.338294 0.382684
C  5.520746 -0.427593 0.315458
C  3.174339 -0.27732 1.382205
C  6.522812 0.184481 -0.689165
C  1.83325 0.494827 1.424335
C  7.862388 -0.583696 -0.763577
C  0.840786 -0.140819 2.409447
C  8.856799 0.034278 -1.770265
C  -1.637914 -0.072203 1.02527
C  -3.86211 0.213017 -0.161067
C  -4.693482 -1.022743 -1.922577
C  -5.948272 0.805007 -0.987057
C  -5.865403 -0.23397 -1.944869
H  3.721464 0.361727 -0.627556
H  4.375401 1.395043 0.661147
H  5.324484 -1.484739 0.03891
H  5.981841 -0.450873 1.325235
H  3.628064 -0.295275 2.395332
H  2.982195 -1.333869 1.103099
H  6.723002 1.241029 -0.412435
H  6.061277 0.21055 -1.698569
H  2.019931 1.549773 1.70583
H  1.382775 0.50209 0.413692
H  8.323271 -0.610121 0.245103
H  7.661219 -1.638819 -1.040562
H  0.589159 -1.173553 2.111698
H  1.214369 -0.136224 3.447829
H  8.430243 0.046775 -2.791175
H  9.804114 -0.534688 -1.806918
H  9.099935 1.078602 -1.496901
H  -3.151403 1.315149 1.392344
H  -4.544552 -1.849528 -2.625684
H  -6.820132 1.46539 -0.929044
H  -6.667197 -0.416968 -2.663648
