program: Gaussian 09
title: 000256108
version: EM64L-G09RevD.01
frameworkgroup: C1[X(C6H14O7S2)]
method: RPBEPBE
basis: SDD
operation: Freq
keyword: #p
keyword: freq=noraman
keyword: PBEPBE/SDD
title: #p freq=noraman PBEPBE/SDD
converged: YES YES NO NO
title: Mulliken charges:
elementType: S S O O O O O O O C C C C C C H H H H H H H H H H H H H H
charge: 1.053472 1.062593 -0.423414 -0.428623 -0.427249 -0.500671 -0.522487 -0.505753 -0.519484 -0.076311 -0.425860 -0.288573 -0.253948 -0.727539 -0.730339 0.260036 0.247780 0.205582 0.214444 0.251907 0.248901 0.226539 0.331596 0.286351 0.285171 0.293608 0.283548 0.289555 0.289169
chargesum: 0.00000
title: Mulliken charges with hydrogens summed into heavy atoms:
elementType: S S O O O O O O O C C C C C C
charge: 1.053472 1.062593 -0.423414 -0.428623 -0.095653 -0.500671 -0.522487 -0.505753 -0.519484 0.183725 0.027503 0.177778 0.221491 0.137591 0.131933
polarizability: 1.86489341e+02 -6.51933925e+00 1.40527044e+02 -3.76418609e+00 -2.15261377e+00 1.25782507e+02
1716.lowfreq: -11.7582 -6.3465 -3.0586 -0.0006 0.0021 0.0022 3.2792 7.6750 19.1332
frequency: -11.3945 7.5640 18.9239 24.4083 28.9613 82.1888 90.0459 95.0622 128.8697 139.2076 165.7507 180.0540 193.1597 206.4588 213.1150 217.3639 230.5480 271.2162 286.7078 299.4728 329.6055 347.5540 353.5725 361.0862 372.1617 408.9272 452.3839 489.9881 551.4993 596.1817 596.9965 601.6950 774.0345 830.7265 835.9307 838.3154 911.2184 913.9818 916.0368 936.2488 945.2573 992.8394 995.6084 1018.5988 1036.6767 1038.9784 1047.5495 1094.5296 1123.9674 1166.3376 1191.6788 1216.7178 1287.3404 1310.7908 1315.8605 1316.0579 1351.4360 1358.2262 1364.8585 1376.2513 1414.5094 1416.3269 1416.9676 1417.6284 1439.7750 1476.0789 1476.6585 2959.0440 2972.4565 2995.7945 3040.3248 3041.2375 3055.8086 3058.5601 3071.3222 3094.4226 3188.8848 3189.8269 3197.6030 3198.8495 3530.9386
redmass: 8.5498 5.3386 6.8720 7.3460 5.1118 5.8059 5.1831 6.1653 3.3824 1.0595 1.0905 3.0803 2.9317 3.8049 5.0590 4.9535 4.1661 4.3993 7.1487 5.2208 6.9397 1.3989 4.5366 4.2997 6.8316 5.5853 2.3496 4.6614 8.3657 5.4235 7.9349 6.5464 2.3802 2.9268 11.5407 8.8481 2.8672 2.7719 3.0260 3.1176 2.2375 1.3443 1.3960 1.9550 2.1437 2.0276 2.2684 2.2214 2.4172 1.2686 1.1572 1.1767 1.3046 1.1902 1.1342 1.1363 1.2652 1.2946 1.4152 1.2519 1.0522 1.0516 1.0506 1.0509 1.0911 1.0777 1.0778 1.0611 1.0646 1.0569 1.0247 1.0248 1.0981 1.1022 1.1020 1.0891 1.1077 1.1078 1.1078 1.1078 1.0659
irintensity: 1.3643 2.4540 3.5263 3.8432 4.5502 7.4241 6.2767 3.9423 3.7288 0.2054 0.0899 11.1718 2.1258 3.4812 2.0927 1.2295 7.7688 2.5852 5.7312 16.3517 20.9136 123.6662 11.6953 33.9878 116.4098 11.7087 7.5503 42.5893 97.2036 31.5175 47.6814 34.3155 3.8677 19.9781 107.9309 35.2560 16.4239 29.8185 35.2469 106.7673 70.2140 48.1434 31.8826 82.6086 45.8877 57.1993 40.8906 26.0920 20.6744 31.9749 5.3034 5.8555 20.0174 0.4930 4.1436 4.3922 5.9170 4.8225 20.6201 13.5388 14.4608 13.2417 16.2601 11.9844 10.9688 1.4104 58.0194 28.3170 11.0639 43.5857 0.0404 0.1678 13.0917 6.2691 20.7541 15.2679 0.1638 0.0851 0.0040 0.0075 12.3479
temp: 298.150 k
press: 1.00000 atm
elementType: 16 16 8 8 8 8 8 8 8 6 6 6 6 6 6 1 1 1 1 1 1 1 1 1 1 1 1 1 1
symmnumber: 1
zpe: 553271.7 jmol-1
zpe.correction: 0.210730 hartree
zpe.thermalcorrener: 0.230231 hartree
zpe.thermalcorrenthalpy: 0.231175 hartree
zpe.thermalcorrgfe: 0.158531 hartree
zpe.sumelectzpe: -1558.118272 hartree
zpe.sumelectthermal: -1558.098770 hartree
zpe.sumelectthermalent: -1558.097826 hartree
zpe.sumelectthermalfe: -1558.170471 hartree
dipole: 0.9248 -2.9040 0.6374
dipole: 3.1136
quadrupole: -138.6025 -98.7930 -103.8348
quadrupole: -9.3430 -21.2025 -7.1312
quadrupole: -24.8590 14.9504 9.9086 -9.3430 -21.2025 -7.1312
hfenergy: -1558.3290016 hartree
pointgroup: C01 [X(C6H14O7S2)]
dipole: -0.437287 -1.114013 0.2614627 debye
polarizability: 187.4337455|2.3703103|138.9383745|-1.3108193|-4.2596909|126.4267716 unknown
InChI: InChI=1S/C6H14O7S2/c1-14(8,9)12-4-3-6(7)5-13-15(2,10)11/h6-7H,3-5H2,1-2H3
charge 0 multiplicity 1
29 atoms
S  -4.090756 -0.29487 -0.146575
S  3.976996 -0.686975 0.593189
O  -2.224495 -0.3504 -0.412905
O  2.1180 -0.448154 0.54398
O  0.411026 2.002003 -1.574713
O  -4.881072 -0.751182 -1.480335
O  -4.445119 1.121001 0.560769
O  4.407672 -1.347134 2.004169
O  4.693803 0.673147 0.079843
C  -0.168901 0.883562 -0.80838
C  0.181114 0.960923 0.688117
C  -1.693642 0.860763 -1.071112
C  1.692361 0.914639 0.955125
C  -4.07559 -1.706347 1.119373
C  3.9806 -2.007651 -0.767589
H  0.296355 -0.009204 -1.254412
H  -0.312443 0.126082 1.217171
H  -0.214927 1.90455 1.120586
H  -2.172278 1.765318 -0.637478
H  -1.878129 0.820936 -2.159484
H  2.230572 1.669713 0.352248
H  1.901956 1.065241 2.030823
H  0.078614 2.860026 -1.201607
H  -3.47832 -1.348121 1.967041
H  -5.126658 -1.887323 1.382769
H  -3.613549 -2.561106 0.608762
H  5.018832 -2.357877 -0.847835
H  3.29457 -2.793412 -0.425621
H  3.627507 -1.505053 -1.676717
