program: Gaussian 09
title: 000250593
version: EM64L-G09RevD.01
frameworkgroup: C1[X(C5H7ClN2O2)]
method: RPBEPBE
basis: SDD
operation: Freq
keyword: #p
keyword: freq=noraman
keyword: PBEPBE/SDD
title: #p freq=noraman PBEPBE/SDD
converged: NO NO NO NO
title: Mulliken charges:
elementType: Cl O O N N C C C C C H H H H H H H
charge: 0.222585 -0.195486 -0.209193 -0.409420 -0.509201 0.181884 0.248078 -0.665129 -0.665151 0.259693 0.330213 0.238235 0.249542 0.217791 0.238232 0.217796 0.249532
chargesum: 0.00000
title: Mulliken charges with hydrogens summed into heavy atoms:
elementType: Cl O O N N C C C C C
charge: 0.222585 -0.195486 -0.209193 -0.079207 -0.509201 0.181884 0.248078 0.040439 0.040408 0.259693
polarizability: 1.11662213e+02 -3.56545202e+00 8.58372973e+01 -1.39352161e-03 -1.10172259e-04 5.25403001e+01
1716.lowfreq: -16.5113 -13.1706 -1.6316 -0.0021 -0.0011 0.0010 66.0312 109.8397 159.2850
frequency: 66.0304 109.8337 159.2779 176.7189 202.1134 232.5738 233.3854 279.1594 301.5492 309.9342 434.3215 448.7728 469.2137 584.7791 598.3859 616.4657 685.9688 701.9282 819.7875 918.4713 935.9737 967.5547 1000.6506 1043.9528 1130.6438 1172.9014 1198.0406 1223.1337 1272.8727 1360.4767 1375.3517 1396.7078 1455.8951 1461.7194 1475.3684 1482.1522 1675.8944 1731.1769 2990.3769 2992.6419 3089.7747 3094.1514 3106.9164 3111.6539 3593.8550
redmass: 4.9765 6.0776 9.0994 11.3096 1.0330 1.2111 3.7821 2.5520 15.3062 2.6098 2.6312 1.2735 6.0808 5.1758 11.1413 3.5759 10.1048 8.7294 6.7705 2.2654 1.5104 1.9854 1.2987 7.6441 5.5662 4.0502 2.3128 4.2545 5.6825 1.6457 1.1870 1.2323 1.0457 1.0492 1.0642 1.0605 11.8234 10.7732 1.0351 1.0355 1.1004 1.0999 1.1014 1.1008 1.0798
irintensity: 2.2844 0.3860 0.2197 0.9284 0.0293 0.9389 8.3570 2.2848 3.0309 0.4400 3.0094 141.7680 2.7510 17.0742 40.4333 1.5673 13.5888 15.3391 30.4911 10.4341 2.0070 21.2383 0.9758 43.7646 67.0123 14.7927 2.2502 64.5664 163.4823 33.3696 17.5536 6.6804 6.2117 2.9409 7.8450 16.2543 556.3227 224.6056 11.9805 20.0946 6.6208 26.1288 8.2576 18.1676 48.7396
temp: 298.150 k
press: 1.00000 atm
elementType: 17 8 8 7 7 6 6 6 6 6 1 1 1 1 1 1 1
symmnumber: 1
zpe: 321128.6 jmol-1
zpe.correction: 0.122311 hartree
zpe.thermalcorrener: 0.132657 hartree
zpe.thermalcorrenthalpy: 0.133601 hartree
zpe.thermalcorrgfe: 0.086464 hartree
zpe.sumelectzpe: -913.973964 hartree
zpe.sumelectthermal: -913.963619 hartree
zpe.sumelectthermalent: -913.962674 hartree
zpe.sumelectthermalfe: -914.009812 hartree
dipole: 4.5385 1.2040 0.0003
dipole: 4.6955
quadrupole: -59.4412 -75.9168 -63.0879
quadrupole: 9.5007 0.0007 0.0006
quadrupole: 6.7074 -9.7682 3.0607 9.5007 0.0007 0.0006
hfenergy: -914.0962753 hartree
pointgroup: C01 [X(C5H7Cl1N2O2)]
dipole: -1.6031932 -0.9178752 -0.0001368 debye
dipolederiv: -0.3507111 -0.162468 -0.00006 -0.2378122 -0.072369 -0.0000349 -0.0001382 -0.0000754 0.1170393 -0.524111 0.1838402 -0.0000054 0.4338328 -0.9629864 0.0000995 0.0003067 -0.0003521 -0.3269566 -1.0452305 0.4093659 0.0000508 0.4135422 -0.7427955 -0.0000465 0.0000759 -0.0000219 -0.3347306 -1.1365654 -0.128152 -0.0000322 -0.0943016 -0.4857638 -0.0000633 -0.0001188 -0.0000738 -0.5683851 -0.1889023 0.9040418 0.0002612 0.6470725 -0.931485 -0.0000783 0.0001788 0.0001006 -0.2196277 0.3223915 -0.2323505 -0.0000505 -0.295655 0.1109883 0.000001 0.0000503 0.0000291 0.3784408 1.1338098 -0.5418543 -0.0000655 -0.698988 1.0246483 -0.0000544 -0.0003229 0.0002356 0.1823817 -0.0381626 0.0501891 0.0311837 -0.0100919 0.0044799 0.0307137 -0.0134708 -0.0561521 -0.0487416 -0.0381367 0.050211 -0.0312007 -0.0101031 0.0045257 -0.03073 0.013442 0.0561357 -0.0487061 1.6419439 -0.4435378 -0.0000787 -0.1763071 1.7976724 0.0002192 -0.0001019 0.0001319 0.3027956 0.1510099 -0.0176203 0.0000051 0.0374941 0.1825369 -0.0000065 0.0000439 0.0000218 0.3736644 0.0229047 0.0062757 -0.1118731 0.0007882 0.1016577 0.0056268 -0.0715987 0.0040956 -0.0660682 0.0198277 0.0674568 0.0170562 0.1177101 -0.0103376 -0.0067056 0.0116111 0.0286145 0.0942753 -0.0064165 -0.1095625 0.0273908 -0.1228232 -0.0560344 -0.0004599 0.0237434 -0.0232236 0.0682333 0.022984 0.0062619 0.1118484 0.0007674 0.101666 -0.0056136 0.0715761 -0.0040722 -0.0661435 -0.0064516 -0.109552 -0.0273991 -0.1228395 -0.0560522 0.00047 -0.0237221 0.0232637 0.0682477 0.0198161 0.067455 -0.0170309 0.1177146 -0.0103516 0.0066625 -0.0115546 -0.0286574 0.0942814 unknown
polarizability: 111.722555|3.3392332|85.7769534|0.0037655|0.0082483|52.5403023 unknown
InChI: InChI=1S/C5H7ClN2O2/c1-5(2)3(9)8(6)4(10)7-5/h7H,1-2H3
charge 0 multiplicity 1
17 atoms
Cl 2.443043 1.518652 0.00044
O  -0.717436 2.138012 0.000437
O  2.168651 -1.637973 -0.000269
N  -0.204709 -1.410236 -0.000343
N  0.994852 0.473513 -0.000029
C  -1.215187 -0.324735 -0.000101
C  -0.320538 0.954621 -0.000224
C  -2.085237 -0.340302 1.28043
C  -2.085709 -0.340151 -1.280305
C  1.109957 -0.979301 -0.000195
H  -0.432941 -2.403354 -0.000369
H  -1.45656 -0.356858 2.186896
H  -2.720731 0.560843 1.306837
H  -2.737155 -1.232838 1.28499
H  -1.457366 -0.356619 -2.187004
H  -2.737636 -1.23268 -1.284714
H  -2.721198 0.561008 -1.306382
