program: Gaussian 09
title: 000256062
version: EM64L-G09RevD.01
frameworkgroup: C1[X(C14H9BrO3)]
method: RPBEPBE
basis: SDD
operation: Freq
keyword: #p
keyword: freq=noraman
keyword: PBEPBE/SDD
title: #p freq=noraman PBEPBE/SDD
converged: YES YES NO NO
title: Mulliken charges:
elementType: Br O O O C C C C C C C C C C C C C C H H H H H H H H H
charge: 0.022254 -0.198543 -0.436139 -0.231780 0.250178 0.360327 0.002475 0.097663 -0.360847 -0.332072 -0.348501 -0.343910 -0.222701 -0.220225 -0.184086 -0.183870 -0.221608 0.089726 0.265685 0.282798 0.253499 0.280542 0.240655 0.239988 0.253054 0.255250 0.390185
chargesum: 0.00000
title: Mulliken charges with hydrogens summed into heavy atoms:
elementType: Br O O O C C C C C C C C C C C C C C
charge: 0.022254 -0.198543 -0.045953 -0.231780 0.250178 0.360327 0.002475 0.097663 -0.095161 -0.049273 -0.095001 -0.063368 0.017954 0.019763 0.068968 0.071380 -0.221608 0.089726
polarizability: 2.56819616e+02 1.30332990e+01 1.48056362e+02 2.55520446e+01 -1.04787514e+01 1.36783587e+02
1716.lowfreq: -3.1810 -1.4118 -0.0007 -0.0006 0.0006 8.5126 16.1105 41.4551 49.8252
frequency: 16.0636 41.4443 49.8162 62.7272 95.3119 116.3112 127.6070 165.7375 212.7572 216.7962 262.4773 272.8312 310.2722 356.8813 385.2093 405.3461 412.9611 463.9266 480.0168 506.9236 573.8768 591.4836 597.6852 620.7203 644.2653 672.2017 691.0278 711.1096 734.8717 765.5083 782.5226 792.0551 835.1848 853.9516 894.3247 917.5950 967.5852 976.4729 990.2305 996.8176 1004.1766 1006.4790 1041.4312 1057.4453 1100.5705 1110.6596 1152.5076 1163.4055 1179.3821 1185.2972 1259.1461 1286.0684 1292.8103 1321.9932 1368.5933 1379.0993 1392.6221 1427.4602 1466.6797 1475.4383 1547.1676 1573.9952 1580.5371 1593.0864 1601.6725 1635.6259 3138.1394 3142.3735 3152.9731 3155.9453 3166.1166 3171.1827 3176.0113 3181.6003 3530.6203
redmass: 7.9008 5.1235 5.6958 9.7901 8.7433 5.4289 8.3499 8.4710 7.7426 6.7014 7.2337 5.8934 7.8657 5.9816 7.0248 2.9150 3.2139 4.3760 5.3145 5.1011 4.5283 1.4373 3.1837 7.1214 5.8874 4.4985 3.7305 6.2077 3.3154 4.2087 2.7975 2.0115 1.3052 1.6090 1.6528 4.0945 1.3635 1.4063 1.4419 4.0085 3.4653 1.5625 2.4013 2.6289 2.1956 1.3625 2.2643 1.7592 1.0739 1.1640 2.2099 1.9751 1.2811 2.6351 5.2225 10.4057 4.0775 2.1926 2.3631 2.6745 10.6129 7.0201 7.6559 6.5901 6.3293 8.7599 1.0864 1.0890 1.0911 1.0885 1.0968 1.0957 1.0974 1.0977 1.0643
irintensity: 0.2231 0.3887 1.2585 0.8694 3.2648 0.4140 1.4283 1.7925 1.7344 5.1232 2.3941 1.3267 0.8415 14.5005 12.0319 1.6483 9.0332 18.0565 6.7093 22.5812 2.3345 92.3376 40.5014 1.0983 9.8641 9.5472 79.3606 5.0010 56.8570 26.3393 22.0245 21.3205 5.6947 35.3459 17.3932 80.5056 0.1055 3.6991 6.8763 45.0007 193.0174 39.9057 5.9385 46.8697 70.4042 7.6175 10.5312 73.1651 0.5329 15.6248 128.8102 122.9355 10.9415 83.6127 15.1807 11.6055 19.3358 9.2088 23.1835 7.6029 180.7090 23.7186 60.9674 82.3342 10.1260 248.7498 1.8553 4.4422 8.7285 0.1972 13.4977 5.5118 2.9266 9.7796 53.2284
temp: 298.150 k
press: 1.00000 atm
elementType: 35 8 8 8 6 6 6 6 6 6 6 6 6 6 6 6 6 6 1 1 1 1 1 1 1 1 1
symmnumber: 1
zpe: 499974.6 jmol-1
zpe.correction: 0.190430 hartree
zpe.thermalcorrener: 0.206063 hartree
zpe.thermalcorrenthalpy: 0.207008 hartree
zpe.thermalcorrgfe: 0.144364 hartree
zpe.sumelectzpe: -776.786433 hartree
zpe.sumelectthermal: -776.770800 hartree
zpe.sumelectthermalent: -776.769856 hartree
zpe.sumelectthermalfe: -776.832499 hartree
dipole: -2.1910 1.8791 -3.1433
dipole: 4.2675
quadrupole: -103.5924 -107.0148 -111.9539
quadrupole: -4.9590 13.1135 6.1698
quadrupole: 3.9280 0.5055 -4.4336 -4.9590 13.1135 6.1698
hfenergy: -776.9768636 hartree
pointgroup: C01 [X(C14H9Br1O3)]
dipole: -1.0164443 -0.4330181 -1.2642312 debye
polarizability: 253.5433902|33.8400894|135.4582282|-5.0504221|-9.2994486|152.6579469 unknown
InChI: InChI=1S/C14H9BrO3/c15-10-7-5-9(6-8-10)13(16)11-3-1-2-4-12(11)14(17)18/h1-8,17H
charge 0 multiplicity 1
27 atoms
Br 5.44662 0.177862 -1.521002
O  -0.166356 -0.341006 2.610897
O  -2.023558 2.427617 -1.50537
O  -0.531905 2.191877 0.255642
C  -1.37599 -0.611327 0.55098
C  1.195317 -0.198535 0.622928
C  -0.109364 -0.335376 1.345808
C  -1.980972 0.317567 -0.347488
C  -1.991271 -1.871587 0.746779
C  -3.159084 -0.040946 -1.053526
C  1.337299 -0.525994 -0.750195
C  2.333047 0.234832 1.353502
C  -3.161706 -2.224095 0.039548
C  -3.742814 -1.310119 -0.870265
C  2.591216 -0.421712 -1.389225
C  3.588869 0.3518 0.729072
C  3.7015 0.020734 -0.6402
C  -1.424249 1.692286 -0.471013
H  -1.544202 -2.572431 1.459057
H  -3.609664 0.6924 -1.727507
H  0.474042 -0.876287 -1.326187
H  2.210043 0.481289 2.412867
H  -3.618899 -3.206227 0.201067
H  -4.651586 -1.579514 -1.418329
H  2.701825 -0.680475 -2.445936
H  4.462215 0.694823 1.290692
H  -1.628573 3.340446 -1.517599
