program: Gaussian 09
title: 000256065
version: EM64L-G09RevD.01
frameworkgroup: C1[X(C11H16NO5P)]
method: RPBEPBE
basis: SDD
operation: Freq
keyword: #p
keyword: freq=noraman
keyword: PBEPBE/SDD
title: #p freq=noraman PBEPBE/SDD
converged: YES YES NO NO
title: Mulliken charges:
elementType: P O O O O O N C C C C C C C C C C C H H H H H H H H H H H H H H H H
charge: 1.290834 -0.498358 -0.526348 -0.621242 -0.204372 -0.209611 0.027269 -0.925872 0.532635 -0.302175 -0.409843 -0.224231 -0.254989 -0.357561 -0.352179 0.374776 -0.658162 -0.648616 0.279265 0.309126 0.286106 0.242555 0.212410 0.226197 0.226883 0.242016 0.289349 0.287545 0.207194 0.232836 0.239791 0.220201 0.248692 0.217879
chargesum: 0.00000
title: Mulliken charges with hydrogens summed into heavy atoms:
elementType: P O O O O O N C C C C C C C C C C C
charge: 1.290834 -0.498358 -0.526348 -0.621242 -0.204372 -0.209611 0.027269 -0.337481 0.532635 -0.016068 -0.167288 0.214375 0.213910 -0.068212 -0.064633 0.374776 0.021659 0.038156
polarizability: 2.44948802e+02 -1.45134710e+01 1.52207723e+02 1.39588761e+01 2.12565420e+01 1.30620132e+02
1716.lowfreq: -7.6899 -5.7339 -0.0020 -0.0020 -0.0017 1.9747 12.4397 23.8367 28.0564
frequency: 11.9896 23.1708 27.9582 34.8180 53.1621 59.8906 68.2732 70.0863 108.4840 127.4482 138.0542 176.5626 189.9407 216.7506 243.5300 247.7908 267.2900 287.5878 325.2022 333.9071 360.7286 390.4947 407.9798 416.3188 445.3272 491.7827 506.4267 596.1309 613.3835 625.4614 663.7993 669.1692 701.3622 747.6137 765.7492 805.2982 812.4790 820.7530 847.1360 854.2477 860.3266 876.0047 901.1564 986.8532 995.7339 1006.5890 1013.0699 1019.7583 1038.2839 1092.1447 1092.4721 1103.0680 1109.3923 1129.5584 1144.7594 1156.5951 1187.0689 1215.3109 1222.6570 1256.3512 1259.1712 1271.9204 1306.9076 1352.4291 1354.6660 1366.1879 1392.7523 1394.0266 1400.8850 1414.2321 1427.7760 1456.1656 1463.7152 1465.6064 1474.9570 1482.6028 1482.9791 1487.6053 1596.3634 1609.6883 2969.3173 2986.9990 2995.6590 3011.5120 3025.7110 3035.5364 3079.8717 3084.2433 3092.6818 3099.7723 3107.4270 3111.3082 3136.8205 3145.7512 3183.1508 3185.5833
redmass: 4.5356 4.1562 3.3359 2.6998 3.8755 2.5713 5.3208 5.0478 5.3344 4.3131 4.6410 8.0034 2.8976 2.9548 1.4942 1.2930 5.9365 3.4895 2.9679 5.6346 4.9593 4.6541 2.9128 4.7245 4.1453 4.2440 7.1415 5.7590 6.0368 6.7459 6.5901 4.8471 5.1994 4.3696 7.4216 1.1316 1.1007 4.8753 1.4347 1.4710 3.1297 3.0079 2.0510 1.3487 1.3886 3.0870 2.9168 2.9837 5.8911 2.3657 2.7445 2.0254 1.4668 1.4226 1.5052 1.1733 1.4338 2.2468 4.4222 1.1618 1.5130 1.1162 1.3002 1.2153 1.2517 7.2384 1.2267 1.2377 7.8378 1.7261 1.6160 1.0399 1.0498 1.0659 1.0630 2.3540 1.0527 1.0904 7.6567 6.1996 1.0565 1.0356 1.0367 1.0617 1.0606 1.1059 1.1026 1.0978 1.0982 1.1014 1.1048 1.1018 1.0908 1.0922 1.0943 1.0953
irintensity: 0.5737 0.8154 0.1207 0.2530 1.9314 2.4698 1.6019 1.9691 1.5091 0.9031 9.5709 7.5758 7.5998 1.3669 2.9585 2.3575 4.7262 19.9468 3.8956 5.5520 13.7701 5.4111 0.7186 13.1663 14.7477 38.2394 5.8723 49.6017 1.5823 14.1959 139.8683 54.0462 23.3887 12.6857 4.3309 8.2518 3.6180 39.4692 14.8026 25.9928 167.8451 42.6886 111.2374 1.1036 2.8320 10.9867 158.8821 139.5096 45.0599 25.6598 8.0916 0.0509 46.8212 4.5737 4.0671 9.3676 80.2464 10.7146 281.0808 2.1259 12.7969 0.1138 1.5570 12.8046 4.4048 91.1875 27.3776 22.2526 3.0912 25.3219 42.8239 10.0447 12.0676 6.3009 3.8151 9.8177 16.4780 8.8633 2.6762 64.4460 35.8108 14.7573 21.0009 34.0395 3.3615 28.4281 3.0593 40.2382 23.8128 2.2380 34.5666 30.1752 11.0507 0.1703 0.7282 3.1769
temp: 298.150 k
press: 1.00000 atm
elementType: 15 8 8 8 8 8 7 6 6 6 6 6 6 6 6 6 6 6 1 1 1 1 1 1 1 1 1 1 1 1 1 1 1 1
symmnumber: 1
zpe: 685894.9 jmol-1
zpe.correction: 0.261244 hartree
zpe.thermalcorrener: 0.281402 hartree
zpe.thermalcorrenthalpy: 0.282346 hartree
zpe.thermalcorrgfe: 0.208070 hartree
zpe.sumelectzpe: -1199.398003 hartree
zpe.sumelectthermal: -1199.377845 hartree
zpe.sumelectthermalent: -1199.376901 hartree
zpe.sumelectthermalfe: -1199.451177 hartree
dipole: 6.2067 1.8899 4.3503
dipole: 7.8115
quadrupole: -134.9137 -109.3232 -117.0165
quadrupole: 5.8719 -2.5999 -1.4164
quadrupole: -14.4959 11.0946 3.4013 5.8719 -2.5999 -1.4164
hfenergy: -1199.6592465 hartree
pointgroup: C01 [X(C11H16N1O5P1)]
dipole: 2.4124592 -0.3781459 -1.8660525 debye
polarizability: 240.7554766|23.9232345|150.7884231|-18.0161201|21.0935193|136.2327579 unknown
InChI: InChI=1S/C11H16NO5P/c1-3-16-18(15,17-4-2)9-10-5-7-11(8-6-10)12(13)14/h5-8H,3-4,9H2,1-2H3
charge 0 multiplicity 1
34 atoms
P  2.070316 0.855643 -0.036601
O  2.083058 -0.803912 0.483382
O  3.474705 1.056878 -1.047671
O  1.966968 1.838716 1.209602
O  -5.078667 0.185011 1.453809
O  -5.200147 -1.378437 -0.202894
N  -4.582578 -0.444132 0.441545
C  0.73772 1.030913 -1.360914
C  -0.641202 0.637089 -0.875928
C  -1.225069 1.286589 0.246458
C  -1.371717 -0.376909 -1.547976
C  2.287236 -1.901144 -0.505135
C  4.738789 1.531938 -0.403741
C  -2.515314 0.936367 0.684295
C  -2.6653 -0.737726 -1.124573
C  -3.219233 -0.071659 -0.01085
C  2.53971 -3.166663 0.309827
C  5.493571 0.38748 0.278869
H  1.061493 0.440675 -2.233412
H  0.782582 2.099623 -1.637892
H  -0.65443 2.051264 0.785142
H  -0.930933 -0.879734 -2.416416
H  1.372978 -2.00206 -1.124583
H  3.145501 -1.654623 -1.159745
H  5.30772 1.956001 -1.24731
H  4.489243 2.335823 0.314164
H  -2.980505 1.420592 1.546794
H  -3.246399 -1.511818 -1.632231
H  2.667392 -4.034151 -0.364201
H  3.450636 -3.057981 0.922158
H  1.69018 -3.367325 0.983843
H  6.452754 0.762351 0.682513
H  4.908251 -0.028616 1.117557
H  5.714396 -0.422564 -0.438181
