program: Gaussian 09
title: 000256066
version: EM64L-G09RevD.01
frameworkgroup: C1[X(C15H14O)]
method: RPBEPBE
basis: SDD
operation: Freq
keyword: #pfreq=noraman
keyword: PBEPBE/SDD
title: #p freq=noraman PBEPBE/SDD
converged: YES YES NO NO
title: Mulliken charges:
elementType: O C C C C C C C C C C C C C C C H H H H H H H H H H H H H H
charge: -0.224549 0.190037 0.305645 0.450636 -0.562032 -0.004625 -0.404207 -0.369386 0.295012 -0.796380 -0.814783 -0.358807 -0.367698 -0.238275 -0.232317 -0.231754 0.269652 0.232728 0.232191 0.233181 0.210153 0.262027 0.236369 0.226238 0.226835 0.266205 0.272697 0.230839 0.232051 0.232316
chargesum: 0.00000
title: Mulliken charges with hydrogens summed into heavy atoms:
elementType: O C C C C C C C C C C C C C C C
charge: -0.224549 0.190037 0.305645 0.450636 -0.292380 -0.004625 -0.171479 -0.137195 0.295012 -0.091018 -0.125340 -0.092602 -0.095001 -0.007436 -0.000266 0.000562
polarizability: 2.24784103e+02 3.69185880e+00 1.69715956e+02 -1.18274034e+01 9.90783945e+00 1.02533180e+02
1716.lowfreq: -7.2481 -2.1567 -0.0003 -0.0002 0.0004 5.6257 24.1780 38.1216 58.5292
frequency: 24.1337 38.1130 58.5191 74.4733 115.9742 132.6542 137.6162 190.6848 226.9655 247.2617 308.3417 316.6776 361.0215 404.3981 411.5171 432.9768 444.2469 461.7847 502.6310 571.3779 613.9227 648.6004 684.9921 695.8179 704.0275 742.8350 754.3594 807.3895 830.9780 845.3774 862.2576 913.9484 941.4424 951.2013 966.8675 989.1604 990.5583 997.0033 1004.9539 1012.9744 1026.0514 1043.7612 1050.1049 1083.1292 1114.3098 1164.2887 1173.5207 1186.8524 1214.6232 1223.9514 1281.6000 1288.0468 1317.7021 1367.6863 1383.8755 1390.9904 1398.6735 1404.2552 1433.0013 1455.1209 1467.1523 1471.1687 1474.5079 1478.5837 1491.4930 1540.4258 1574.9773 1588.0869 1607.3823 1618.2791 2976.4939 2990.6449 3055.9016 3078.2652 3084.2495 3087.8108 3114.9466 3127.1915 3130.5436 3137.7947 3140.1721 3149.7987 3158.6097 3168.5968
redmass: 1.0369 4.7638 3.6616 4.4697 2.4362 3.7726 1.2406 4.3261 4.7163 3.9579 3.4696 3.2465 6.5850 2.9050 3.3572 3.9262 3.3798 4.6702 3.3026 4.4538 6.4356 6.1559 4.3719 5.9526 1.7217 2.5199 3.6210 2.4705 1.4178 5.6163 1.2509 1.4043 2.0033 1.6893 1.3580 5.8688 1.3953 1.8874 1.3368 1.3686 2.1931 1.5705 1.5434 1.5852 2.7853 1.3701 1.0577 1.1257 5.4710 1.7550 4.1790 1.4259 1.3568 6.7617 8.8389 2.9555 1.2260 1.2130 2.2614 1.0663 1.0980 1.0536 2.0793 1.1462 3.1318 7.8778 5.7719 6.3295 6.0795 6.2229 1.0376 1.0364 1.0969 1.0966 1.0992 1.1009 1.0871 1.0851 1.0911 1.0883 1.0966 1.0924 1.0959 1.1011
irintensity: 0.4269 2.4461 0.0660 0.5782 3.7003 0.6215 0.3056 1.1478 1.6400 0.2264 5.3411 1.2847 4.2347 0.1623 1.1494 2.4435 2.9641 0.4215 10.9147 9.8497 0.2300 26.7161 0.6462 0.8527 60.7532 34.8498 11.1092 9.7665 29.7626 29.9992 2.3491 7.5645 19.1498 12.3674 0.1209 1.6251 2.0037 4.2391 1.0584 0.9947 3.4719 4.0747 19.0606 10.7504 5.0725 3.6238 0.5374 24.6768 19.8400 29.7993 225.8520 14.3412 13.4197 23.4546 2.4821 8.2558 8.3170 22.8253 14.2387 16.2572 2.2738 12.1174 0.7979 18.7516 26.7247 159.0981 17.6032 10.8709 12.9044 2.4091 36.0397 25.2059 19.6570 11.2862 16.2992 27.4524 11.2806 0.5164 18.7571 8.1472 25.9344 16.8988 19.9548 22.4779
temp: 298.150 k
press: 1.00000 atm
elementType: 8 6 6 6 6 6 6 6 6 6 6 6 6 6 6 6 1 1 1 1 1 1 1 1 1 1 1 1 1 1
symmnumber: 1
zpe: 634826.2 jmol-1
zpe.correction: 0.241793 hartree
zpe.thermalcorrener: 0.256394 hartree
zpe.thermalcorrenthalpy: 0.257339 hartree
zpe.thermalcorrgfe: 0.198631 hartree
zpe.sumelectzpe: -654.106588 hartree
zpe.sumelectthermal: -654.091986 hartree
zpe.sumelectthermalent: -654.091042 hartree
zpe.sumelectthermalfe: -654.149750 hartree
dipole: -0.2942 3.1516 1.1629
dipole: 3.3722
quadrupole: -77.3441 -93.7463 -94.9487
quadrupole: 2.3373 -1.8641 -1.4743
quadrupole: 11.3356 -5.0666 -6.2690 2.3373 -1.8641 -1.4743
hfenergy: -654.3483808 hartree
pointgroup: C01 [X(C15H14O1)]
dipole: 0.2921244 1.2106873 -0.4572749 debye
polarizability: 219.5833407|-12.7993273|172.753739|-21.6090609|-5.6694177|104.6961597 unknown
InChI: InChI=1S/C15H14O/c1-11-8-9-12(2)14(10-11)15(16)13-6-4-3-5-7-13/h3-10H,1-2H3
charge 0 multiplicity 1
30 atoms
O  -0.813188 -2.211715 0.787264
C  0.855391 -0.666916 -0.031822
C  1.7709 -1.623001 -0.577576
C  2.633143 1.065539 0.040791
C  1.300231 0.652805 0.263835
C  -0.553863 -1.056975 0.319266
C  3.096834 -1.189395 -0.827974
C  3.526193 0.119691 -0.523911
C  -1.677588 -0.070981 0.124365
C  1.380287 -3.052964 -0.904625
C  3.099119 2.464955 0.40373
C  -1.630659 0.959362 -0.853543
C  -2.858235 -0.238639 0.897731
C  -2.742417 1.808502 -1.047402
C  -3.960538 0.619113 0.714686
C  -3.905654 1.646068 -0.259701
H  0.591362 1.363064 0.704871
H  3.807011 -1.899565 -1.268138
H  4.564971 0.41003 -0.725779
H  0.40777 -3.111463 -1.424025
H  2.148646 -3.527884 -1.539435
H  1.264039 -3.647561 0.018156
H  3.753218 2.44889 1.296587
H  3.680904 2.923054 -0.417065
H  2.247587 3.129933 0.628801
H  -0.738309 1.077105 -1.476983
H  -2.887439 -1.054262 1.627907
H  -2.703946 2.591252 -1.813023
H  -4.862394 0.489344 1.322973
H  -4.765375 2.309514 -0.407061
