program: Gaussian 09
title: 000256053
version: EM64L-G09RevD.01
frameworkgroup: C1[X(C13H18N2)]
method: RPBEPBE
basis: SDD
operation: Freq
keyword: #pfreq=noraman
keyword: PBEPBE/SDD
title: #p freq=noraman PBEPBE/SDD
converged: YES YES NO NO
title: Mulliken charges:
elementType: N N C C C C C C C C C C C C C H H H H H H H H H H H H H H H H H H
charge: -0.080548 -0.017313 -0.365368 -0.386535 -0.386026 -0.403961 -0.377685 -0.429525 -0.379803 0.430129 -0.401474 -0.385221 -0.227070 -0.222013 -0.249219 0.203173 0.184161 0.201696 0.220430 0.217941 0.202261 0.210104 0.214759 0.239683 0.195937 0.222579 0.227280 0.201205 0.215101 0.261626 0.220219 0.219799 0.223677
chargesum: 0.00000
title: Mulliken charges with hydrogens summed into heavy atoms:
elementType: N N C C C C C C C C C C C C C
charge: -0.080548 -0.017313 0.021967 0.035590 0.034176 0.020902 0.057935 0.020334 -0.178598 0.430129 -0.186372 -0.123595 -0.006852 -0.002213 -0.025542
polarizability: 2.60795211e+02 5.82056400e+00 1.48141173e+02 2.11480574e+01 -2.69985619e+00 9.85899729e+01
1716.lowfreq: -25.7074 -13.7356 -9.9063 -0.0002 0.0000 0.0006 24.7545 34.8208 68.1037
frequency: 21.5737 34.4224 68.0464 90.6930 132.2634 145.7358 243.5166 260.0377 269.5429 290.5464 319.4662 354.7884 357.0632 405.9007 446.1808 480.2699 503.4246 524.4131 585.8986 614.4790 620.9956 698.7412 730.9547 747.9552 765.3697 790.1356 838.3681 846.0914 849.5998 870.3006 872.7302 898.1114 921.9183 959.1508 973.7278 975.8892 985.2272 994.4986 1000.1531 1021.8106 1049.2732 1070.3863 1088.0485 1098.3248 1130.9652 1168.0698 1169.8127 1179.4687 1184.0508 1217.3249 1236.3320 1241.0827 1265.1471 1287.7083 1312.1866 1317.0249 1327.5583 1334.4217 1339.6869 1348.9131 1354.9126 1358.5290 1377.7858 1398.8685 1435.4282 1447.9913 1454.0106 1462.8585 1465.4015 1472.4630 1477.1358 1483.9774 1553.6053 1585.2132 1610.6106 2958.7406 2970.3044 2971.8624 2976.7463 2985.8828 2988.4254 3018.8403 3020.3075 3025.9105 3033.6361 3038.9664 3058.1028 3073.8202 3108.2884 3121.9279 3135.1168 3152.6623 3163.9352
redmass: 3.6510 3.5914 3.3084 3.5902 3.1240 2.3495 3.6436 2.9537 2.7432 2.7048 2.7842 4.0233 2.7786 2.8584 2.2799 2.0442 2.6902 3.0284 3.5255 5.5701 4.7678 1.7219 1.3235 2.6787 1.7890 2.7781 2.5180 1.2972 1.8321 1.8695 2.1979 1.8794 1.5227 2.1315 1.9862 1.3739 6.2277 1.3242 2.0155 2.1328 2.0799 1.8116 1.8444 1.9083 2.1409 1.1205 1.4502 1.1223 1.6380 1.5547 1.2946 1.8507 1.2359 1.3963 1.3649 1.3954 1.3032 1.3627 1.3994 1.3482 1.3382 1.3950 3.5575 2.3712 2.2992 1.0920 1.0885 1.0935 1.0869 1.0880 1.1993 2.1296 5.8761 5.7299 6.1222 1.0630 1.0619 1.0606 1.0615 1.0648 1.0662 1.0932 1.0916 1.0953 1.1003 1.1011 1.1006 1.1005 1.0868 1.0862 1.0924 1.0954 1.0998
irintensity: 0.5517 0.0158 0.3347 1.4475 1.1635 1.9761 0.9388 1.6787 6.5422 1.8503 3.4546 5.6446 0.4568 0.0459 0.4186 5.7209 12.3316 24.9329 6.2513 3.1865 7.6148 50.8023 8.5573 3.4224 38.1465 5.9700 11.9218 5.0328 3.8480 21.7956 18.0902 34.1499 17.4408 6.3593 1.5307 0.0612 3.1437 1.1167 17.6199 9.3924 3.4559 40.9455 12.9167 50.4895 21.0090 3.0798 19.0150 0.1325 14.2129 18.2582 0.6593 4.2253 0.4769 7.6051 15.0720 1.3983 2.0905 0.1687 8.3230 2.0698 38.5245 1.2453 18.7741 68.7650 18.7617 6.4292 8.8660 10.3178 8.8683 21.9967 23.4736 1.3980 202.7382 36.8441 17.1693 34.9460 38.0702 3.6634 38.3782 54.6630 66.1998 33.4322 66.9750 45.8353 49.4868 59.7957 63.3973 26.4941 14.5799 0.4358 34.5161 33.6435 22.8314
temp: 298.150 k
press: 1.00000 atm
elementType: 7 7 6 6 6 6 6 6 6 6 6 6 6 6 6 1 1 1 1 1 1 1 1 1 1 1 1 1 1 1 1 1 1
symmnumber: 1
zpe: 745381.4 jmol-1
zpe.correction: 0.283901 hartree
zpe.thermalcorrener: 0.297644 hartree
zpe.thermalcorrenthalpy: 0.298588 hartree
zpe.thermalcorrgfe: 0.242010 hartree
zpe.sumelectzpe: -614.517639 hartree
zpe.sumelectthermal: -614.503896 hartree
zpe.sumelectthermalent: -614.502952 hartree
zpe.sumelectthermalfe: -614.559530 hartree
dipole: -3.2123 1.1457 0.0195
dipole: 3.4106
quadrupole: -81.5411 -83.8155 -94.2568
quadrupole: 0.4361 3.2015 -1.8447
quadrupole: 4.9967 2.7223 -7.7190 0.4361 3.2015 -1.8447
hfenergy: -614.8015401 hartree
pointgroup: C01 [X(C13H18N2)]
dipole: -1.2468384 -0.4096399 -0.279402 debye
polarizability: 260.2846021|12.5059198|134.4292055|-20.3990307|21.9744785|112.8125497 unknown
InChI: InChI=1S/C13H18N2/c1-2-7-11-15(10-6-1)14-12-13-8-4-3-5-9-13/h3-5,8-9,12H,1-2,6-7,10-11H2
charge 0 multiplicity 1
33 atoms
N  -1.719535 -0.402856 0.993227
N  -0.440933 0.052845 0.831171
C  -3.936993 0.723973 -0.768678
C  -2.906713 -0.03977 -1.649304
C  -3.296329 1.494927 0.414475
C  -2.548848 -1.476501 -1.187102
C  -2.674768 0.595525 1.510792
C  -2.263549 -1.612159 0.342308
C  0.46914 -0.647291 0.16698
C  1.85333 -0.165478 0.068248
C  2.805561 -0.924647 -0.670952
C  2.284521 1.046339 0.685471
C  4.14282 -0.489287 -0.792923
C  3.618985 1.477843 0.561015
C  4.558379 0.714722 -0.178365
H  -4.46735 1.459186 -1.405201
H  -4.715551 0.02493 -0.39564
H  -3.28971 -0.108597 -2.68654
H  -1.979795 0.565334 -1.702464
H  -2.50677 2.162902 0.01666
H  -4.05604 2.144242 0.895965
H  -3.38262 -2.164697 -1.43071
H  -1.676897 -1.822784 -1.774402
H  -2.134764 1.216406 2.246019
H  -3.476788 0.048699 2.044024
H  -3.203285 -1.843183 0.874547
H  -1.577075 -2.462933 0.527399
H  0.246905 -1.608931 -0.328767
H  2.491424 -1.861011 -1.150607
H  1.553552 1.62757 1.256581
H  4.860247 -1.088272 -1.365851
H  3.934666 2.41151 1.04152
H  5.59618 1.053943 -0.271198
