program: Gaussian 09
title: 000256089
version: EM64L-G09RevD.01
frameworkgroup: C1[X(C18H14O3)]
method: RPBEPBE
basis: SDD
operation: Freq
keyword: #pfreq=noraman
keyword: PBEPBE/SDD
title: #p freq=noraman PBEPBE/SDD
converged: YES YES NO NO
title: Mulliken charges:
elementType: O O O C C C C C C C C C C C C C C C C C C H H H H H H H H H H H H H H
charge: -0.242687 -0.194600 -0.215798 0.209940 0.213817 0.123473 0.455260 0.452040 -0.782338 -0.359849 -0.363789 -0.451254 -0.450351 0.006459 -0.247079 -0.261683 -0.244149 -0.249582 0.130960 -0.272349 -0.654803 0.248677 0.288868 0.265047 0.246961 0.247699 0.232720 0.235785 0.233483 0.234855 0.238681 0.227655 0.218621 0.233725 0.245585
chargesum: 0.00000
title: Mulliken charges with hydrogens summed into heavy atoms:
elementType: O O O C C C C C C C C C C C C C C C C C C
charge: -0.242687 -0.194600 -0.215798 0.209940 0.213817 0.123473 0.455260 0.452040 -0.533661 -0.070982 -0.098741 -0.204292 -0.202652 0.006459 -0.014359 -0.025898 -0.010666 -0.014727 0.130960 0.193987 0.043128
polarizability: 2.88171477e+02 -4.21353007e+01 2.51342899e+02 3.46471856e+01 1.69763419e+01 1.26805308e+02
1716.lowfreq: -2.6710 0.0008 0.0009 0.0009 4.1662 8.9382 22.8335 36.0523 38.0883
frequency: 22.6513 35.9944 38.0558 64.1405 87.7527 102.9039 112.9171 153.6748 162.4434 205.5119 226.5204 237.3998 265.1044 288.0303 307.6250 335.6298 368.5337 386.7133 397.3451 414.6016 458.9697 474.4508 500.8398 510.5948 549.4873 585.8599 604.4165 639.2522 659.7713 671.2426 705.2466 744.8326 754.9757 761.2492 774.2968 782.9727 809.7538 820.4263 839.3488 856.6709 870.5313 875.8906 898.2868 928.9147 940.9694 969.5677 979.3782 996.1617 997.2873 1003.1007 1028.6661 1032.5265 1059.2899 1095.4956 1105.9537 1148.2833 1154.8564 1172.1719 1177.1557 1191.0037 1204.4649 1258.4434 1274.4203 1279.2510 1296.9426 1332.4555 1350.9511 1358.0027 1390.2507 1393.2231 1414.7831 1434.5805 1445.7363 1449.0310 1457.8583 1462.6311 1482.4432 1492.0769 1527.1795 1550.9160 1568.9001 1581.5731 1621.4985 1625.0569 1632.0428 2994.3252 3032.1636 3089.5412 3097.0294 3117.5364 3123.2176 3124.4874 3125.6289 3137.8432 3139.6579 3156.8590 3160.7976 3169.3523 3189.0179
redmass: 3.6548 4.8555 3.8676 4.3152 4.8444 5.0000 4.0391 6.5416 3.4755 1.8934 3.0053 4.7095 4.0656 3.4319 3.3678 10.6017 6.1716 4.8042 4.8908 5.0210 4.4418 2.8765 3.4186 3.4603 6.6219 3.5933 6.9778 6.2597 6.4118 5.4243 4.7182 2.2082 2.6441 2.1132 1.4464 3.2603 1.9014 1.8676 3.7005 5.1774 1.6226 1.5433 5.5614 5.7672 1.9006 1.3634 1.4926 1.3591 1.3602 2.5007 2.4171 2.1690 7.1786 2.1818 2.2635 2.8752 1.6424 1.3922 1.3114 1.2259 1.2941 1.6190 1.1212 2.3402 1.7039 6.5007 1.2919 2.9762 1.7452 1.2280 4.7725 10.4035 2.5675 2.2399 1.0935 1.0435 1.0533 2.6257 5.9818 8.7251 9.2292 5.4361 10.3013 6.3273 6.0423 1.0363 1.0598 1.0974 1.1025 1.0914 1.1064 1.0869 1.0868 1.0890 1.0907 1.0946 1.0980 1.0996 1.0949
irintensity: 0.8673 0.6250 1.4168 1.1540 0.2144 0.5226 0.5916 3.3726 0.6030 2.1281 5.0830 0.0766 2.1307 10.6240 6.3625 3.0235 0.9239 0.7452 0.8445 2.7633 16.0605 2.7619 1.3793 31.5018 10.4077 2.8025 11.2033 0.7478 2.0294 14.1021 22.6709 81.5138 16.7855 33.4485 0.3591 8.9199 0.9444 7.3143 7.6526 0.9607 25.8084 0.3605 39.5790 12.9899 10.6066 0.2973 18.6926 1.0855 0.3172 39.4062 3.1477 9.2013 251.8674 15.4786 0.7143 75.7978 11.7542 26.6957 17.5903 13.9397 5.5147 9.4197 2.7135 49.2166 1.0932 23.4901 0.8081 4.7547 1.4245 18.9392 2.2103 0.2612 15.9815 21.3367 12.3935 14.4930 21.7857 12.7876 44.1508 188.9219 43.2440 4.0613 150.9139 16.1020 3.8694 13.3662 29.7406 38.6363 2.4247 4.7225 23.9654 1.0136 3.4159 9.6833 19.5521 18.1772 34.0854 22.8432 9.1987
temp: 298.150 k
press: 1.00000 atm
elementType: 8 8 8 6 6 6 6 6 6 6 6 6 6 6 6 6 6 6 6 6 6 1 1 1 1 1 1 1 1 1 1 1 1 1 1
symmnumber: 1
zpe: 705114.1 jmol-1
zpe.correction: 0.268564 hartree
zpe.thermalcorrener: 0.286383 hartree
zpe.thermalcorrenthalpy: 0.287327 hartree
zpe.thermalcorrgfe: 0.221261 hartree
zpe.sumelectzpe: -918.536042 hartree
zpe.sumelectthermal: -918.518223 hartree
zpe.sumelectthermalent: -918.517279 hartree
zpe.sumelectthermalfe: -918.583345 hartree
dipole: 0.6238 3.5727 4.1027
dipole: 5.4758
quadrupole: -103.2400 -113.2403 -126.7941
quadrupole: -3.8948 -3.5299 -7.2632
quadrupole: 11.1848 1.1845 -12.3692 -3.8948 -3.5299 -7.2632
hfenergy: -918.8046061 hartree
pointgroup: C01 [X(C18H14O3)]
dipole: -0.8365649 0.2253233 1.9724774 debye
polarizability: 211.0201999|-41.6216361|279.9807084|-36.3210707|-67.3242046|175.3187748 unknown
InChI: InChI=1S/C18H14O3/c1-2-21-18(20)17(19)16-14-9-5-3-7-12(14)11-13-8-4-6-10-15(13)16/h3-11H,2H2,1H3
charge 0 multiplicity 1
35 atoms
O  2.846346 0.118813 0.276729
O  1.682195 0.446395 -2.828806
O  3.382984 -1.503734 -1.323771
C  -0.607538 1.391863 -1.075548
C  -0.341557 -0.898938 -0.10964
C  0.135946 0.163287 -0.952957
C  -1.802517 1.576585 -0.255104
C  -1.537167 -0.688934 0.697388
C  -2.222137 0.544962 0.614968
C  -0.218686 2.482138 -1.936411
C  0.267994 -2.205424 -0.06345
C  -2.540087 2.812409 -0.329192
C  -2.019844 -1.743441 1.551351
C  1.439365 0.023723 -1.662386
C  -0.958333 3.661938 -1.982119
C  -0.228372 -3.206075 0.769797
C  -2.1328 3.835711 -1.175199
C  -1.376197 -2.974503 1.599616
C  2.64323 -0.589919 -0.899277
C  4.052883 -0.253898 1.0923
C  3.717479 -1.399109 2.050211
H  -3.115855 0.70038 1.233038
H  0.654968 2.36614 -2.579987
H  1.107061 -2.443911 -0.723151
H  -3.431373 2.926098 0.299103
H  -2.917689 -1.558698 2.152843
H  -0.641517 4.470835 -2.649657
H  0.251433 -4.190871 0.77698
H  -2.697898 4.772155 -1.230536
H  -1.750032 -3.774849 2.246694
H  4.869482 -0.525916 0.400652
H  4.295375 0.678772 1.62516
H  4.5829 -1.592301 2.711178
H  2.849392 -1.143168 2.681184
H  3.494064 -2.325816 1.495798
