program: Gaussian 09
title: 000250584
version: EM64L-G09RevD.01
frameworkgroup: C1[X(C10H14BrNO2)]
method: RPBEPBE
basis: SDD
operation: Freq
keyword: #p
keyword: freq=noraman
keyword: PBEPBE/SDD
title: #p freq=noraman PBEPBE/SDD
converged: NO YES NO NO
title: Mulliken charges:
elementType: Br O O N C C C C C C C C C C H H H H H H H H H H H H H H
charge: 0.049219 -0.220349 -0.112274 -0.174167 0.020833 -0.416508 -0.432429 -0.395529 -0.395126 -0.393335 -0.338397 -0.601933 0.129395 0.125744 0.251906 0.183901 0.230593 0.219162 0.193368 0.207111 0.205665 0.205128 0.205652 0.208683 0.191123 0.263981 0.249757 0.338825
chargesum: 0.00000
title: Mulliken charges with hydrogens summed into heavy atoms:
elementType: Br O O N C C C C C C C C C C
charge: 0.049219 -0.220349 -0.112274 -0.174167 0.272738 -0.002013 -0.019899 0.017247 0.015654 0.006471 0.175341 -0.263108 0.129395 0.125744
polarizability: 1.57578096e+02 4.09152392e+00 1.30734121e+02 -5.75241378e+00 -8.43110610e-01 1.06675028e+02
1716.lowfreq: -13.3194 -3.8184 -0.0006 -0.0005 0.0006 1.6476 27.5313 38.6390 65.4189
frequency: 26.3081 36.7825 65.3503 77.9853 126.2984 145.8598 202.2913 218.2546 234.7784 291.3223 327.7714 331.5165 350.9120 423.6796 440.4577 465.2870 487.8381 535.7761 579.8509 636.4727 680.9257 736.9635 773.0122 787.5986 790.3242 842.1121 872.3897 895.4820 919.3460 943.8686 971.1406 1003.2171 1011.8145 1045.8634 1056.2431 1068.3766 1073.1671 1110.8110 1136.8371 1154.7424 1176.6490 1189.8570 1195.3139 1223.6964 1253.2821 1255.0868 1259.5202 1264.8160 1308.8456 1328.8016 1334.6892 1338.6835 1341.5886 1342.9659 1357.2491 1397.2233 1461.2250 1461.5750 1465.8983 1472.1442 1477.6418 1481.3500 1636.3980 1674.9050 2962.9380 2966.3734 2968.9151 2971.2576 2975.9564 2976.6186 3000.5010 3034.9968 3035.7133 3040.8827 3045.4519 3053.4202 3069.6143 3122.9554
redmass: 6.3757 3.7492 8.7414 3.7712 5.3089 11.6671 3.2632 1.7929 3.6464 3.8912 7.3493 1.9038 5.4110 3.7212 2.7105 5.1311 1.6475 5.6924 4.9720 5.3734 4.7490 5.0853 5.2294 1.6289 2.5847 2.2383 1.7660 1.5997 1.7633 2.6501 2.2751 1.9991 2.4212 1.8458 1.2086 4.0924 1.4036 2.4178 2.0398 1.3656 2.8122 1.4545 1.3390 1.5264 1.8519 1.3870 1.2702 1.7210 1.3089 1.3369 1.3457 1.3720 1.4839 1.4985 1.6012 1.7324 1.0884 1.0898 1.0867 1.0844 1.0926 1.0893 11.7789 12.3634 1.0642 1.0653 1.0653 1.0674 1.0623 1.0616 1.0818 1.0973 1.0953 1.1009 1.1005 1.1023 1.0948 1.0887
irintensity: 0.8605 0.2747 0.4828 2.3878 0.9053 1.2440 6.4158 0.1176 1.6332 3.0188 4.0649 1.2121 0.4352 7.2351 2.4061 16.9974 2.6697 1.3307 5.6912 15.7791 3.9023 1.0936 1.1362 0.2849 0.5550 3.9476 1.9434 18.2473 0.2021 4.5228 6.4414 11.6014 21.8683 1.5016 0.4378 43.3245 5.2037 0.0952 10.4733 2.9236 22.1255 1.3331 15.9888 1.3574 35.6307 17.6719 1.2882 42.7525 0.5433 5.8826 0.4077 0.4426 0.4416 1.1417 0.6326 6.8390 1.1900 8.1164 9.7843 18.6398 7.2713 2.2016 184.8503 248.2343 7.6038 20.9457 25.4790 60.3692 29.8245 26.7713 22.2859 63.9938 63.8447 2.8796 21.7000 82.4915 10.7818 2.9900
temp: 298.150 k
press: 1.00000 atm
elementType: 35 8 8 7 6 6 6 6 6 6 6 6 6 6 1 1 1 1 1 1 1 1 1 1 1 1 1 1
symmnumber: 1
zpe: 596960.7 jmol-1
zpe.correction: 0.227370 hartree
zpe.thermalcorrener: 0.240858 hartree
zpe.thermalcorrenthalpy: 0.241802 hartree
zpe.thermalcorrgfe: 0.184793 hartree
zpe.sumelectzpe: -607.049712 hartree
zpe.sumelectthermal: -607.036225 hartree
zpe.sumelectthermalent: -607.035281 hartree
zpe.sumelectthermalfe: -607.092290 hartree
dipole: -4.2486 -4.0748 4.1131
dipole: 7.1814
quadrupole: -94.8671 -105.3728 -90.6746
quadrupole: -4.9809 3.3570 7.5695
quadrupole: 2.1044 -8.4013 6.2969 -4.9809 3.3570 7.5695
hfenergy: -607.2770824 hartree
pointgroup: C01 [X(C10H14Br1N1O2)]
dipole: 1.9819592 -1.4056372 -1.4417821 debye
polarizability: 157.8321797|1.4519552|129.6182732|-6.6700643|-4.1024634|107.5367916 unknown
InChI: InChI=1S/C10H14BrNO2/c11-8-6-12(10(14)9(8)13)7-4-2-1-3-5-7/h7-8H,1-6H2
charge 0 multiplicity 1
28 atoms
Br -2.901518 -2.345486 0.559232
O  -1.089721 1.973139 1.13473
O  -3.74985 1.035081 -0.010685
N  -0.33197 0.132721 -0.158712
C  1.112611 0.298726 0.109242
C  1.67792 -0.879088 0.946758
C  1.926527 0.501786 -1.193666
C  3.173948 -0.644584 1.26825
C  3.421766 0.735517 -0.866049
C  4.002804 -0.421953 -0.018883
C  -0.871767 -0.910169 -1.060921
C  -2.387242 -0.902039 -0.785655
C  -1.290841 0.981105 0.384833
C  -2.652525 0.455634 -0.113895
H  1.180245 1.223447 0.717115
H  1.573875 -1.827525 0.379659
H  1.090689 -0.984245 1.877576
H  1.515393 1.359307 -1.759606
H  1.835697 -0.397536 -1.838143
H  3.571239 -1.506177 1.837672
H  3.269835 0.243669 1.925463
H  3.526618 1.687112 -0.306143
H  3.995777 0.852035 -1.804907
H  5.057389 -0.209333 0.240356
H  4.002566 -1.353885 -0.621656
H  -0.407861 -1.889508 -0.861075
H  -0.684807 -0.650777 -2.123215
H  -3.027497 -1.099174 -1.656074
