program: Gaussian 09
title: 000018312
version: EM64L-G09RevD.01
frameworkgroup: C1[X(C9H20)]
method: RPBEPBE
basis: SDD
operation: Freq
keyword: #p
keyword: freq=noraman
keyword: PBEPBE/SDD
title: #p freq=noraman PBEPBE/SDD
converged: YES YES NO NO
title: Mulliken charges:
elementType: C C C C C C C C C H H H H H H H H H H H H H H H H H H H H
charge: 0.026694 -0.450376 -0.028671 -0.400114 -0.413563 -0.721328 -0.712577 -0.721199 -0.719863 0.200921 0.198911 0.188076 0.186029 0.197411 0.199532 0.191642 0.208565 0.214329 0.208589 0.211563 0.207484 0.210137 0.217511 0.209654 0.213112 0.220614 0.221309 0.224013 0.211594
chargesum: 0.00000
title: Mulliken charges with hydrogens summed into heavy atoms:
elementType: C C C C C C C C C
charge: 0.227615 -0.063388 0.157358 -0.003170 -0.013357 -0.086846 -0.077445 -0.077818 -0.062947
polarizability: 1.08136117e+02 3.23466916e-01 9.45800822e+01 2.65659902e-01 1.36251664e-01 8.94166696e+01
1716.lowfreq: -34.1499 -25.2791 -14.1967 -0.0006 -0.0006 0.0004 36.6765 78.5224 95.5777
frequency: 32.8692 77.9467 95.5268 128.4743 153.8889 197.5046 211.8541 216.8300 240.4992 245.3644 282.8586 319.7261 348.0523 376.4712 415.2092 497.9982 565.6837 724.3389 764.9127 778.2821 808.2817 863.9090 906.3022 917.2431 939.1872 956.1124 991.1337 1003.7408 1022.7800 1049.5904 1056.8928 1091.3276 1135.3225 1154.8437 1169.7665 1194.6721 1234.1847 1247.9921 1267.5166 1294.6021 1302.5466 1324.7242 1335.8208 1342.5267 1356.9238 1364.3846 1375.1233 1384.6244 1388.4363 1393.2090 1456.4283 1462.5222 1466.5810 1470.6066 1475.3243 1477.5024 1483.2602 1484.4160 1484.9225 1490.3936 1494.9750 2938.8689 2943.2881 2959.2056 2967.7707 2971.5975 2973.0520 2974.8106 2975.2528 2979.7475 3007.0017 3019.2161 3031.2892 3059.8723 3062.5770 3064.2965 3065.2537 3068.1947 3073.2040 3076.2700 3080.3765
redmass: 2.6633 2.1786 2.1611 1.8688 2.1979 1.1763 1.1858 1.3275 2.3786 1.1127 1.9148 2.0746 1.9724 2.1949 2.3274 2.2515 2.3056 1.8439 1.3886 2.0015 1.5026 1.7523 1.3467 1.3724 1.8556 1.4550 2.0097 1.4647 1.6695 2.2380 1.5710 1.6128 1.9720 2.1625 2.1862 2.0232 1.3904 1.2662 1.1514 1.2130 1.2945 1.4885 1.4384 1.3391 1.4961 1.3370 1.2131 1.2383 1.2113 1.2138 1.0794 1.0620 1.0472 1.0594 1.0484 1.0578 1.0490 1.0510 1.0461 1.0568 1.0716 1.0709 1.0794 1.0702 1.0359 1.0450 1.0455 1.0427 1.0577 1.0458 1.0995 1.0997 1.0970 1.0994 1.0995 1.0992 1.0989 1.0991 1.0998 1.0996 1.0979
irintensity: 0.0194 0.0150 0.0079 0.0727 0.0987 0.0387 0.0647 0.0255 0.0825 0.1013 0.2927 0.1135 0.1372 0.7145 0.5182 4.3957 0.8443 3.8511 3.9539 2.2937 5.4967 2.2544 8.1669 6.6595 1.3411 0.2825 1.8436 0.7844 6.9963 0.9237 1.8799 2.4559 0.2197 1.3445 2.6838 4.4658 5.2055 7.2509 3.0423 1.4511 0.0870 2.4858 1.1509 2.5970 0.0359 1.3887 15.9480 28.1441 12.5946 14.5250 1.6703 6.0370 1.0775 9.0661 7.1083 15.2602 19.5368 6.3026 8.9146 4.4135 8.3908 11.9425 13.3227 73.0431 27.7546 22.0916 8.1437 16.5623 108.6859 15.3192 51.3926 33.5088 27.1900 16.1436 52.0123 45.1911 64.6091 80.7112 33.0185 76.7474 65.2131
temp: 298.150 k
press: 1.00000 atm
elementType: 6 6 6 6 6 6 6 6 6 1 1 1 1 1 1 1 1 1 1 1 1 1 1 1 1 1 1 1 1
symmnumber: 1
zpe: 706311.7 jmol-1
zpe.correction: 0.269020 hartree
zpe.thermalcorrener: 0.281514 hartree
zpe.thermalcorrenthalpy: 0.282459 hartree
zpe.thermalcorrgfe: 0.230856 hartree
zpe.sumelectzpe: -354.170251 hartree
zpe.sumelectthermal: -354.157757 hartree
zpe.sumelectthermalent: -354.156813 hartree
zpe.sumelectthermalfe: -354.208415 hartree
dipole: 0.1065 -0.1298 -0.1048
dipole: 0.1979
quadrupole: -61.0118 -60.8261 -61.0016
quadrupole: -0.3349 -0.0011 0.1878
quadrupole: -0.0653 0.1204 -0.0551 -0.3349 -0.0011 0.1878
hfenergy: -354.4392713 hartree
pointgroup: C01 [X(C9H20)]
dipole: 0.0431511 0.0580603 0.028823 debye
polarizability: 108.1024688|-0.4816708|94.4297691|-0.7543038|-0.8775005|89.6006307 unknown
InChI: InChI=1S/C9H20/c1-5-9(6-2)7-8(3)4/h8-9H,5-7H2,1-4H3
charge 0 multiplicity 1
29 atoms
C  -0.530698 0.149807 0.483421
C  0.56878 0.995568 -0.22653
C  2.0522 0.498808 -0.199531
C  -0.730927 -1.258133 -0.145704
C  -1.858628 0.964819 0.566316
C  2.481488 -0.048125 1.183411
C  2.407998 -0.497384 -1.333326
C  -1.838856 -2.104812 0.520886
C  -2.559371 1.232398 -0.786252
H  -0.202487 -0.009093 1.534267
H  0.279989 1.152482 -1.286471
H  0.549668 1.999762 0.248295
H  2.666026 1.405933 -0.390814
H  0.221531 -1.815655 -0.073152
H  -0.942478 -1.154622 -1.229598
H  -1.638907 1.935881 1.056024
H  -2.565753 0.438723 1.237064
H  2.253187 0.673141 1.990809
H  3.569468 -0.247549 1.203286
H  1.965752 -0.99715 1.42208
H  3.497356 -0.692798 -1.349669
H  2.123165 -0.089114 -2.321489
H  1.897818 -1.468677 -1.21214
H  -1.676099 -2.181962 1.613209
H  -1.851625 -3.131378 0.109662
H  -2.842471 -1.670753 0.361901
H  -2.832918 0.289469 -1.294387
H  -1.916472 1.810955 -1.47407
H  -3.489537 1.810959 -0.635199
