program: Gaussian 09
title: 000256090
version: EM64L-G09RevD.01
frameworkgroup: C1[X(C20H19Cl2N3S)]
method: RPBEPBE
basis: SDD
operation: Freq
keyword: #p
keyword: freq=noraman
keyword: PBEPBE/SDD
title: #p freq=noraman PBEPBE/SDD
converged: YES YES NO NO
title: Mulliken charges:
elementType: Cl Cl S N N N C C C C C C C C C C C C C C C C C C C C H H H H H H H H H H H H H H H H H H H
charge: -0.047983 -0.049008 0.302008 -0.164617 -0.003333 -0.057943 -0.392576 -0.391508 0.449119 -0.371095 -0.347370 -0.584429 -0.584434 0.452334 -0.395653 -0.404871 -0.359230 0.339608 0.343633 -0.395484 -0.354273 -0.370942 -0.703429 -0.240065 -0.231301 -0.240853 0.254605 0.251502 0.253258 0.251901 0.235532 0.235805 0.294953 0.269472 0.293729 0.270292 0.233269 0.279280 0.255587 0.214327 0.268840 0.263066 0.224862 0.225158 0.228257
chargesum: 0.00000
title: Mulliken charges with hydrogens summed into heavy atoms:
elementType: Cl Cl S N N N C C C C C C C C C C C C C C C C C C C C
charge: -0.047983 -0.049008 0.302008 -0.164617 -0.003333 -0.057943 0.113531 0.113650 0.449119 -0.135564 -0.111565 -0.020004 -0.020412 0.452334 -0.162385 -0.125591 -0.103643 0.339608 0.343633 -0.395484 -0.139946 -0.102101 -0.440363 -0.015203 -0.006143 -0.012597
polarizability: 6.83096491e+02 1.43746108e+01 3.15680051e+02 2.04131070e+00 2.93533748e+01 1.26758649e+02
1716.lowfreq: -12.8788 -4.6199 0.0025 0.0025 0.0029 0.3159 3.4493 13.4842 21.0246
frequency: -10.9433 13.1142 21.0209 25.7020 29.3732 42.4697 55.1427 61.6834 86.1355 95.1769 108.1466 126.8107 136.3249 159.1411 182.9994 203.9519 211.6829 242.3820 242.6294 249.4070 286.8889 299.7342 311.2300 333.2295 388.2672 393.2106 402.2399 403.5164 425.2987 471.5296 476.9794 516.6385 535.0086 542.0460 586.2293 596.9648 616.6605 632.6599 657.4440 664.2006 674.6821 696.2819 702.9996 703.7538 740.2136 747.8159 762.3180 784.5769 790.1836 791.0219 810.1473 813.4789 831.3855 851.9407 859.7437 891.3921 930.3701 946.2892 951.0932 981.1617 985.8664 989.3095 994.9029 996.2034 998.8796 1000.9820 1020.1100 1034.2493 1035.1034 1036.0232 1041.5785 1078.6479 1108.5893 1117.9120 1139.6135 1171.6060 1182.3347 1188.8523 1198.5713 1205.5430 1217.4816 1255.1448 1257.8396 1260.8218 1277.8910 1289.4053 1291.3811 1319.7171 1329.5934 1342.3338 1353.0386 1354.1969 1375.1504 1382.5362 1392.6055 1433.8495 1444.6540 1445.2534 1458.3931 1461.2084 1461.7333 1485.5675 1504.4233 1513.5469 1518.4855 1541.5443 1569.4917 1587.3082 1615.5349 1627.5282 3007.5392 3019.4044 3024.4036 3063.8597 3064.1471 3075.2326 3080.6572 3123.6016 3124.4765 3131.7108 3144.8841 3147.4924 3148.3802 3148.9257 3158.8943 3162.1776 3169.3014 3170.1829 3239.7249
redmass: 4.9602 5.9416 10.0527 7.9910 15.6883 8.6974 4.7216 5.1218 5.4892 5.7638 3.1575 3.3658 3.5022 5.8467 3.8485 7.5895 4.4405 4.5119 6.2806 5.2883 3.7709 5.4275 6.8099 5.7425 4.0597 3.9128 2.8232 5.6341 3.1531 4.7835 3.6334 2.7507 4.3013 4.9297 4.5508 9.0189 6.5128 7.1978 7.5208 7.4768 3.4661 1.9296 5.1774 5.0773 3.3865 1.3631 5.7575 1.1277 1.1762 2.2753 1.3233 5.6438 1.5701 1.2553 5.2541 7.0600 1.4596 1.4966 2.4071 1.3757 1.3811 6.2019 2.8960 1.5513 1.4245 1.3356 3.0347 1.8508 4.0928 2.4469 2.2810 1.6345 3.1327 1.6092 1.4369 1.0575 1.6076 1.1461 1.1767 1.6216 2.0702 1.1688 1.1862 1.6608 1.3166 2.6915 1.1838 1.6002 1.6885 2.0908 1.3246 1.3633 4.8120 6.6685 1.9003 2.5071 4.0107 3.4595 3.3456 1.0989 1.1312 1.1025 1.1393 4.0122 2.9648 6.6241 5.5288 6.2414 6.0728 6.4280 1.0876 1.0602 1.0608 1.0572 1.0578 1.1032 1.1040 1.0846 1.0891 1.0880 1.0936 1.1004 1.1093 1.1003 1.0966 1.0936 1.0963 1.0991 1.0946
irintensity: 0.0132 0.0004 0.0150 0.0637 0.6692 1.1828 0.5229 4.1846 1.1627 0.6531 0.4691 1.8510 0.8976 0.0725 9.7946 5.1380 2.9887 13.3882 1.4204 0.1439 0.9884 2.8558 1.8661 3.5302 9.7138 12.5536 0.0351 5.5691 4.0817 3.2195 5.4676 18.1181 12.3328 15.1518 1.4176 10.8539 0.3242 5.4824 20.9782 164.5487 6.3708 23.2116 30.5228 55.5461 3.0287 131.3976 11.2439 3.3029 13.1700 6.4175 12.4279 30.2928 51.5421 0.0063 1.6015 19.9755 4.0871 11.8490 44.8506 0.0396 3.0166 0.1251 0.8109 14.9431 4.9424 1.9198 64.0805 21.4365 6.3700 37.2723 5.0912 22.7348 111.3507 33.2295 23.7465 1.4187 173.1054 9.0406 99.0251 1.0022 30.4328 17.0836 12.0504 35.2415 95.4820 7.4871 6.8451 37.4355 2.6870 21.5937 101.3715 102.1569 7.0119 19.8054 192.4572 55.1706 4.1211 62.6444 91.8614 12.5769 19.0042 28.3753 10.9942 1.5078 817.9101 169.8881 175.8993 7.1628 28.9060 458.2907 25.5548 21.0500 35.0869 5.7280 24.1580 8.8277 6.3149 4.6852 10.2534 3.4007 31.3712 7.9957 23.3931 4.5054 35.9729 25.4862 23.8044 17.0656 2.9871
temp: 298.150 k
press: 1.00000 atm
elementType: 17 17 16 7 7 7 6 6 6 6 6 6 6 6 6 6 6 6 6 6 6 6 6 6 6 6 1 1 1 1 1 1 1 1 1 1 1 1 1 1 1 1 1 1 1
symmnumber: 1
zpe: 904326.9 jmol-1
zpe.correction: 0.344440 hartree
zpe.thermalcorrener: 0.368236 hartree
zpe.thermalcorrenthalpy: 0.369181 hartree
zpe.thermalcorrgfe: 0.286174 hartree
zpe.sumelectzpe: -2254.095293 hartree
zpe.sumelectthermal: -2254.071496 hartree
zpe.sumelectthermalent: -2254.070552 hartree
zpe.sumelectthermalfe: -2254.153559 hartree
dipole: 1.8679 1.1914 0.2723
dipole: 2.2322
quadrupole: -160.4055 -181.0002 -178.1906
quadrupole: 1.2195 -0.2506 3.8582
quadrupole: 12.7933 -7.8014 -4.9918 1.2195 -0.2506 3.8582
hfenergy: -2254.4397326 hartree
pointgroup: C01 [X(C20H19Cl2N3S1)]
dipole: 0.7180348 -0.4889268 -0.1290222 debye
polarizability: 681.6821197|-25.7373811|315.1641606|-7.9685577|35.0405605|128.6889098 unknown
InChI: InChI=1S/C20H19Cl2N3S/c21-10-12-25(13-11-22)18-8-6-16(7-9-18)14-23-20-24-19(15-26-20)17-4-2-1-3-5-17/h1-9,14-15H,10-13H2
charge 0 multiplicity 1
45 atoms
Cl 7.562635 3.190915 -0.375214
Cl 6.982423 -4.111364 0.18571
S  -3.123579 2.995797 0.701891
N  5.349122 -0.303922 -0.047713
N  -0.99268 1.277142 0.322649
N  -3.278987 0.387923 0.1313
C  6.219688 0.831774 0.312898
C  6.018477 -1.557775 -0.442364
C  3.946684 -0.193872 -0.025226
C  3.107303 -1.314733 -0.325076
C  3.305927 1.049439 0.299306
C  6.443548 1.761742 -0.895038
C  6.143515 -2.518409 0.7558
C  1.076334 0.042521 0.02019
C  1.710541 -1.190336 -0.3036
C  1.912065 1.158166 0.322562
C  -0.374633 0.14068 0.035391
C  -5.720207 -0.096644 0.032334
C  -4.59911 0.849457 0.234714
C  -2.371036 1.340726 0.337515
C  -7.077597 0.31842 0.115541
C  -5.442029 -1.46131 -0.2532
C  -4.713346 2.211739 0.531813
C  -8.12487 -0.604829 -0.080515
C  -6.49099 -2.383678 -0.448906
C  -7.838231 -1.961531 -0.363797
H  5.794317 1.402036 1.156685
H  7.194907 0.442846 0.654463
H  5.476029 -2.050699 -1.267773
H  7.02746 -1.323245 -0.824562
H  3.539607 -2.288403 -0.572031
H  3.900548 1.937984 0.529987
H  5.510987 2.220846 -1.25287
H  6.964448 1.254782 -1.720912
H  5.166088 -2.817483 1.160148
H  6.781139 -2.11027 1.554027
H  1.092974 -2.066498 -0.537614
H  1.429737 2.109342 0.569525
H  -0.947795 -0.775023 -0.204418
H  -7.323147 1.363965 0.333246
H  -4.395482 -1.774174 -0.315859
H  -5.619175 2.799212 0.661289
H  -9.165301 -0.267487 -0.012925
H  -6.258332 -3.431995 -0.66767
H  -8.653677 -2.67737 -0.515702
