program: Gaussian 09
title: 000256028
version: EM64L-G09RevD.01
frameworkgroup: C1[X(C14H20O2)]
method: RPBEPBE
basis: SDD
operation: Freq
keyword: #pfreq=noraman
keyword: PBEPBE/SDD
title: #p freq=noraman PBEPBE/SDD
converged: YES YES NO NO
title: Mulliken charges:
elementType: O O C C C C C C C C C C C C C C H H H H H H H H H H H H H H H H H H H H
charge: -0.260928 -0.254242 -0.341170 -0.415420 -0.341083 0.495041 -0.359595 0.224428 -0.381353 -0.451135 -0.698232 -0.240051 -0.225435 -0.245084 -0.263814 -0.664600 0.235384 0.224928 0.214644 0.204109 0.185358 0.202065 0.195051 0.262693 0.233510 0.209192 0.216697 0.211966 0.224642 0.224700 0.227724 0.224110 0.234521 0.216806 0.248101 0.226473
chargesum: 0.00000
title: Mulliken charges with hydrogens summed into heavy atoms:
elementType: O O C C C C C C C C C C C C C C
charge: -0.260928 -0.254242 -0.105786 0.024152 0.048383 0.495041 0.037520 0.224428 -0.118661 -0.217625 -0.060377 -0.015409 -0.000734 -0.017360 0.194817 0.026780
polarizability: 1.91367345e+02 1.16504219e+01 1.32536066e+02 -1.76555868e-01 -1.14472549e+00 1.40762671e+02
1716.lowfreq: -5.7260 -0.0007 -0.0005 -0.0003 2.9604 6.6500 21.2367 36.3314 45.5730
frequency: 21.1631 36.2004 45.5318 50.5411 59.4637 66.0080 94.7508 120.1507 131.4566 176.6252 188.3189 215.1892 230.0955 243.9736 254.9813 287.1608 335.9566 390.5876 404.6363 417.6698 472.8137 521.0978 590.2108 612.8155 651.5441 703.9975 709.7057 730.6021 758.5566 775.3291 807.1920 814.1710 832.5513 856.0956 873.8307 900.0959 923.0646 944.6721 978.5776 990.1717 994.8294 1000.7417 1020.5246 1027.6775 1051.6672 1071.2622 1079.4409 1093.9030 1104.3257 1112.4963 1133.2200 1157.2682 1171.8889 1190.1746 1195.9588 1212.2486 1236.6385 1273.6771 1277.6541 1279.6370 1289.7658 1325.6607 1332.5886 1343.4788 1355.5977 1358.4546 1384.0900 1388.8332 1389.2864 1442.6059 1455.7525 1457.7174 1461.5290 1465.6733 1475.5814 1476.9457 1481.0137 1484.0077 1486.7830 1592.6978 1609.7123 1630.3273 2956.1035 2968.1628 2971.7708 2986.8961 2992.3558 2999.3279 3023.2074 3029.9580 3032.5228 3055.9298 3068.6716 3071.4840 3087.4428 3093.0874 3117.8285 3119.3169 3124.7240 3136.8764 3146.6955 3162.4320
redmass: 3.8760 3.7501 2.6201 3.8162 3.6330 1.6364 4.6851 3.4123 3.0121 2.0333 2.3175 1.4792 1.3725 3.0669 3.5943 2.9649 4.8528 3.1106 2.8377 3.3044 3.5753 3.8605 4.2711 6.0530 3.1407 3.3563 2.1479 1.1332 1.6807 1.8137 1.3008 2.5795 2.8544 1.2502 2.4067 1.8692 1.4397 1.4304 1.3936 5.2752 1.5210 2.3548 3.3847 2.2261 2.5165 2.0330 1.8785 2.2482 2.3119 2.2685 2.3412 1.6831 1.0579 1.1236 2.3981 1.5664 1.3125 1.2519 1.1348 1.3802 1.0708 1.3271 1.3511 1.3228 1.5048 1.4553 6.1581 1.2421 1.2174 2.1419 1.0925 1.0788 1.0492 1.0751 1.0707 1.0428 2.2253 1.0540 1.0792 6.0820 6.0122 8.3620 1.0591 1.0595 1.0365 1.0609 1.0360 1.0967 1.1003 1.0607 1.0876 1.1014 1.1008 1.0994 1.0974 1.1030 1.0858 1.1062 1.0869 1.0919 1.0961 1.1015
irintensity: 1.3429 0.0335 0.2293 0.4902 0.0823 0.0493 0.3832 1.6308 1.3271 1.5188 1.8525 2.0650 0.3503 0.3937 0.7292 4.3935 13.8362 1.8021 0.0399 1.8818 0.5781 18.2262 10.3306 0.1861 2.7511 15.8859 42.0836 15.2760 15.2754 27.1287 1.7293 4.4780 0.4478 0.2482 2.6617 6.2688 3.3176 5.6638 0.2761 0.3524 0.4925 10.6884 43.5133 6.8026 24.2859 16.4632 15.3790 69.7184 145.3206 15.9593 118.1524 20.6176 0.4331 0.3079 1.5318 6.5351 17.7895 3.2579 2.7945 14.4961 1.4973 10.8853 22.0278 4.6514 3.6563 7.5397 2.3543 20.6470 11.7980 9.8042 8.3968 8.1170 14.3633 1.0302 3.0495 11.9491 25.3865 18.4323 13.0575 3.4290 16.7201 106.4853 8.5881 45.6025 38.4900 37.4293 20.7172 4.8778 14.5161 31.5460 8.3389 20.6418 92.5729 56.8287 36.5211 1.1736 5.3224 32.6462 0.3189 19.1832 30.0843 25.9689
temp: 298.150 k
press: 1.00000 atm
elementType: 8 8 6 6 6 6 6 6 6 6 6 6 6 6 6 6 1 1 1 1 1 1 1 1 1 1 1 1 1 1 1 1 1 1 1 1
symmnumber: 1
zpe: 805898.4 jmol-1
zpe.correction: 0.306950 hartree
zpe.thermalcorrener: 0.324476 hartree
zpe.thermalcorrenthalpy: 0.325420 hartree
zpe.thermalcorrgfe: 0.258919 hartree
zpe.sumelectzpe: -694.719258 hartree
zpe.sumelectthermal: -694.701733 hartree
zpe.sumelectthermalent: -694.700789 hartree
zpe.sumelectthermalfe: -694.767290 hartree
dipole: 0.2980 0.5442 -1.3424
dipole: 1.4789
quadrupole: -90.9415 -90.6205 -96.7619
quadrupole: 3.3981 -1.2498 -0.5565
quadrupole: 1.8331 2.1541 -3.9872 3.3981 -1.2498 -0.5565
hfenergy: -695.0262087 hartree
pointgroup: C01 [X(C14H20O2)]
dipole: -0.1124604 0.2972659 0.4873523 debye
polarizability: 192.1089331|-9.5209466|132.4777455|0.1871566|2.8058415|140.0794042 unknown
InChI: InChI=1S/C14H20O2/c1-3-5-11-13(14(15)16-4-2)12-9-7-6-8-10-12/h6-10,13H,3-5,11H2,1-2H3
charge 0 multiplicity 1
36 atoms
O  -0.753271 2.219956 0.369687
O  -0.87773 0.967968 -1.594986
C  -0.054972 -0.083067 0.498343
C  -0.813511 -1.410408 0.208673
C  -2.307499 -1.368743 0.597155
C  1.454678 -0.233196 0.258407
C  -3.024193 -2.713427 0.337861
C  -0.607135 1.04744 -0.372777
C  1.966948 -0.463042 -1.04516
C  2.356331 -0.181442 1.350097
C  -4.516809 -2.683879 0.731356
C  3.352718 -0.643819 -1.246998
C  3.743538 -0.365736 1.149246
C  4.246399 -0.598898 -0.1511
C  -1.234451 3.428227 -0.37345
C  -2.764558 3.465473 -0.415146
H  -0.216365 0.208176 1.551768
H  -0.715453 -1.646547 -0.868487
H  -0.304238 -2.2209 0.766163
H  -2.819908 -0.569487 0.023426
H  -2.407174 -1.102543 1.670547
H  -2.9277 -2.974353 -0.735407
H  -2.50725 -3.516891 0.90155
H  1.27947 -0.484673 -1.898721
H  1.970986 0.004593 2.360139
H  -4.639133 -2.44994 1.806042
H  -5.005899 -3.65662 0.539695
H  -5.062891 -1.912181 0.156562
H  3.736483 -0.817828 -2.258784
H  4.428557 -0.324483 2.003763
H  5.321469 -0.740452 -0.309508
H  -0.813689 4.268484 0.201561
H  -0.804694 3.406321 -1.39035
H  -3.101877 4.405696 -0.88978
H  -3.159867 2.621475 -1.004796
H  -3.188006 3.421847 0.603208
