program: Gaussian 09
title: 000256003
version: EM64L-G09RevD.01
frameworkgroup: C1[X(C5H10Br2N2O)]
method: RPBEPBE
basis: SDD
operation: Freq
keyword: #p
keyword: freq=noraman
keyword: PBEPBE/SDD
title: #p freq=noraman PBEPBE/SDD
converged: YES YES NO NO
title: Mulliken charges:
elementType: Br Br O N N C C C C C H H H H H H H H H H
charge: -0.046183 -0.046182 -0.318630 -0.390177 -0.390182 -0.351690 -0.351677 0.320709 -0.624019 -0.624024 0.274058 0.249848 0.274061 0.249848 0.307702 0.307701 0.281775 0.297645 0.281777 0.297639
chargesum: 0.00000
title: Mulliken charges with hydrogens summed into heavy atoms:
elementType: Br Br O N N C C C C C
charge: -0.046183 -0.046182 -0.318630 -0.082475 -0.082480 0.172216 0.172232 0.320709 -0.044598 -0.044609
polarizability: 1.20095742e+02 1.46564477e-02 1.14279289e+02 3.15043374e+00 -4.97557707e-03 6.52506316e+01
1716.lowfreq: -5.5123 0.0006 0.0010 0.0010 2.5616 9.7816 13.6213 26.0169 32.4796
frequency: 13.6061 25.2649 32.4788 68.4429 91.4127 110.1172 164.4193 202.6019 269.2540 351.9765 365.0769 426.5640 427.5296 489.1870 526.0061 547.1703 558.2010 664.9700 710.5572 808.3222 831.0448 920.8926 951.9614 973.6165 994.2591 1034.2205 1096.1222 1141.1135 1155.0375 1192.8897 1210.9991 1227.0228 1237.0018 1290.8573 1296.6846 1365.2874 1371.9030 1426.2896 1431.9335 1433.9200 1434.0903 1467.7711 1514.6461 1628.8575 2996.9749 2998.0388 3055.1563 3055.4167 3064.1406 3064.3289 3152.1880 3152.2774 3546.2759 3553.6124
redmass: 6.7526 5.5198 16.4168 5.4026 4.2096 3.0461 6.7219 4.9229 2.0472 2.6473 1.5100 2.7258 2.1832 3.2978 3.4964 3.1528 1.3131 3.3816 9.8126 1.8790 1.8809 1.9570 2.3144 2.4937 1.4894 1.9038 3.9802 1.5667 1.3025 1.9639 1.1938 1.4101 1.6295 1.1586 1.1979 1.2857 1.2924 1.1479 1.0892 1.1048 1.1005 1.4801 2.3762 5.0691 1.0589 1.0591 1.0789 1.0782 1.0802 1.0809 1.1115 1.1114 1.0777 1.0770
irintensity: 0.3093 4.0497 0.0004 22.8060 8.2976 0.0007 0.1833 7.7775 2.0492 42.2577 12.3111 2.2300 4.9298 7.3141 3.8697 11.8109 294.1508 42.6249 11.1296 12.3438 25.8367 9.0269 18.1112 12.7176 4.3270 3.0007 13.9738 0.0187 0.9621 17.7175 1.2339 32.0815 269.0070 45.8114 88.3383 8.8933 6.5881 38.2987 7.0083 0.2572 40.5989 20.0350 604.5941 159.7566 75.8606 1.5085 9.8617 11.5582 21.2806 7.5535 19.5645 0.2161 15.9931 24.3897
temp: 298.150 k
press: 1.00000 atm
elementType: 35 35 8 7 7 6 6 6 6 6 1 1 1 1 1 1 1 1 1 1
symmnumber: 1
zpe: 407448.0 jmol-1
zpe.correction: 0.155189 hartree
zpe.thermalcorrener: 0.167475 hartree
zpe.thermalcorrenthalpy: 0.168419 hartree
zpe.thermalcorrgfe: 0.110821 hartree
zpe.sumelectzpe: -407.400076 hartree
zpe.sumelectthermal: -407.387790 hartree
zpe.sumelectthermalent: -407.386846 hartree
zpe.sumelectthermalfe: -407.444444 hartree
dipole: -0.0001 0.0786 0.0004
dipole: 0.0786
quadrupole: -86.0860 -83.0987 -78.1661
quadrupole: -0.0002 6.6314 -0.0001
quadrupole: -3.6357 -0.6485 4.2842 -0.0002 6.6314 -0.0001
hfenergy: -407.5552646 hartree
pointgroup: C01 [X(C5H10Br2N2O1)]
dipole: 0.0000465 0.0309168 -0.000142 debye
dipolederiv: -0.2883652 -0.0878389 0.0681558 -0.2160346 -0.4277576 0.1282251 0.0931679 0.0598512 -0.2052076 -0.2884902 0.0878769 0.0682322 0.2162409 -0.4277923 -0.1284131 0.0933029 -0.0600125 -0.205303 -0.8093599 0.0000993 -0.0746416 0.0000388 -1.0252218 -0.0002307 -0.1631591 -0.0002613 -0.3946192 -1.443422 -0.1701367 -0.1270758 -0.3360287 -0.3841653 -0.1745231 -0.3310077 -0.1250017 -0.6200688 -1.4435156 0.1703111 -0.126997 0.336367 -0.384386 0.1745414 -0.3307291 0.1251661 -0.6197992 0.6399465 -0.0618802 0.0853885 -0.5194182 -0.1339792 0.0436159 0.1765428 0.0542537 0.2892115 0.6400118 0.0618112 0.085427 0.5191896 -0.1340619 -0.0437589 0.1772544 -0.0544929 0.2890387 2.2075991 -0.0003276 0.538392 -0.0002324 1.349339 0.0003783 0.7737779 0.0003274 0.4785114 0.1642052 0.2463398 -0.0855331 0.3950965 0.6762644 -0.1602399 -0.095119 -0.1867196 0.1002935 0.1645298 -0.2463606 -0.0857721 -0.3955063 0.6764197 0.1607087 -0.0953013 0.1870121 0.1004708 0.1080293 -0.083283 0.0681035 0.1049555 0.0462912 0.0337908 0.0852954 0.0401535 0.1118867 -0.0550111 0.0026953 -0.0706898 0.0250795 0.0962148 -0.1210651 -0.0932966 -0.0594647 -0.0768733 0.1080184 0.0832711 0.0681605 -0.1049143 0.0463644 -0.033859 0.085283 -0.0401905 0.1118289 -0.0551459 -0.0026662 -0.0706312 -0.024973 0.0961332 0.1211129 -0.0936032 0.0595185 -0.0766699 0.1974635 -0.0047157 -0.1022508 0.0478833 0.0955968 0.0392568 -0.1281485 0.0436376 0.3116476 0.1975316 0.0048158 -0.1022525 -0.0479288 0.095681 -0.039374 -0.1282232 -0.043772 0.3115646 -0.1006622 0.0116816 -0.0282636 0.0412234 -0.0705358 0.0627924 -0.0289633 0.0756058 0.0789435 0.0786984 -0.077929 -0.0397811 -0.0838496 -0.0598772 -0.0396177 0.0160207 -0.0057202 -0.0318947 -0.1006877 -0.0117625 -0.0282767 -0.0412237 -0.0705243 -0.0628689 -0.0290245 -0.0757416 0.078846 0.0786262 0.0779986 -0.0396942 0.0840349 -0.0600033 0.0395282 0.0159303 0.0058512 -0.0318077 unknown
polarizability: 120.2733577|-0.014398|114.2792827|0.3903223|0.0177891|65.0730221 unknown
InChI: InChI=1S/C5H10Br2N2O/c6-1-3-8-5(10)9-4-2-7/h8-9H,1-4H2
charge 0 multiplicity 1
20 atoms
Br -4.089427 -1.586113 0.406311
Br 4.088244 -1.585742 -0.407797
O  -0.000799 1.679092 0.000184
N  -1.075284 -0.345911 -0.480573
N  1.073946 -0.346155 0.479326
C  -2.285491 0.312453 -0.969361
C  2.284043 0.311957 0.968721
C  -0.000707 0.405907 -0.000345
C  -3.441726 0.315039 0.03684
C  3.440443 0.315176 -0.037283
H  -2.011631 1.366769 -1.168134
H  -2.61261 -0.148664 -1.91908
H  2.010099 1.366143 1.168076
H  2.611025 -0.149705 1.918224
H  -1.100855 -1.359837 -0.360209
H  1.099613 -1.359993 0.358232
H  -4.328631 0.839264 -0.350862
H  -3.142154 0.708408 1.019082
H  4.327274 0.839181 0.350885
H  3.141029 0.709129 -1.019339
