program: Gaussian 09
title: 000255996
version: EM64L-G09RevD.01
frameworkgroup: C1[X(C8H10N2O2)]
method: RPBEPBE
basis: SDD
operation: Freq
keyword: #p
keyword: freq=noraman
keyword: PBEPBE/SDD
title: #p freq=noraman PBEPBE/SDD
converged: YES YES NO NO
title: Mulliken charges:
elementType: O O N N C C C C C C C C H H H H H H H H H H
charge: -0.301418 -0.252924 -0.390830 -0.381223 0.471771 -0.420357 -0.351231 -0.194118 -0.205530 -0.267026 0.298999 -0.493360 0.218708 0.238895 0.304495 0.221909 0.220874 0.226320 0.338318 0.232496 0.240056 0.245174
chargesum: 0.00000
title: Mulliken charges with hydrogens summed into heavy atoms:
elementType: O O N N C C C C C C C C
charge: -0.301418 -0.252924 -0.086335 -0.042904 0.471771 -0.201648 -0.112336 0.027791 0.015344 -0.040706 0.298999 0.224367
polarizability: 1.45002000e+02 -1.13446052e-01 1.00863609e+02 -1.32880802e+01 -4.95767860e+00 6.92113573e+01
1716.lowfreq: -7.6067 -0.0009 -0.0008 -0.0004 2.9782 6.1049 38.3909 44.8087 51.2332
frequency: 38.3677 44.7885 51.1531 74.2883 136.0477 178.0779 223.9446 254.5553 298.7460 344.9281 406.6754 407.9578 504.0963 532.7413 553.5873 613.2784 638.0059 662.2673 693.6877 707.3834 757.1630 819.2631 825.3434 886.3358 896.1769 959.7059 979.7497 981.1943 998.6496 1022.5085 1083.5516 1119.1130 1144.6665 1160.5997 1170.1625 1181.4077 1212.6286 1310.8818 1323.2685 1384.7978 1423.4811 1432.9988 1452.0214 1458.8047 1471.9548 1485.9947 1495.6262 1601.5414 1619.9405 1680.7635 3002.8415 3103.8676 3115.2642 3128.0076 3140.2833 3145.6528 3154.6543 3168.4489 3518.3814 3540.3192
redmass: 4.8865 3.8953 1.4118 2.9713 3.4469 4.4628 3.5046 5.0437 2.6731 5.3702 2.7204 1.8866 2.9961 5.3889 1.2462 6.1987 4.4740 5.1946 1.9370 7.3012 1.7383 3.2970 1.4048 1.4795 7.7285 1.3652 1.3063 5.8110 7.2452 2.1464 1.5775 1.2535 1.9900 2.4828 1.0707 1.1261 2.6065 1.4518 2.7289 4.7271 1.1491 2.1560 1.0518 1.4793 1.1222 2.2453 1.6185 5.2651 6.2946 8.7557 1.0297 1.1048 1.0870 1.0862 1.0928 1.1045 1.0942 1.1010 1.0774 1.0781
irintensity: 0.7320 0.7072 0.6672 4.5133 5.5189 0.2149 5.7498 8.1121 21.1800 6.0460 5.2763 57.2978 10.4498 3.0846 204.9160 2.7505 43.3358 16.2862 39.4571 11.0530 80.9842 4.5718 2.5398 7.8486 4.9826 0.1688 0.8637 0.5473 45.6530 5.1175 8.6068 0.8514 234.8951 137.7649 13.7112 24.8184 108.1484 2.8543 12.0772 14.7905 1.9846 1.6631 14.5332 173.1661 17.8014 64.2828 48.0062 7.9591 114.5172 229.3690 42.5198 28.0699 12.2769 1.0235 26.6122 17.6404 31.3316 14.6527 19.9269 40.0895
temp: 298.150 k
press: 1.00000 atm
elementType: 8 8 7 7 6 6 6 6 6 6 6 6 1 1 1 1 1 1 1 1 1 1
symmnumber: 1
zpe: 452921.7 jmol-1
zpe.correction: 0.172509 hartree
zpe.thermalcorrener: 0.184344 hartree
zpe.thermalcorrenthalpy: 0.185288 hartree
zpe.thermalcorrgfe: 0.132915 hartree
zpe.sumelectzpe: -569.887915 hartree
zpe.sumelectthermal: -569.876080 hartree
zpe.sumelectthermalent: -569.875135 hartree
zpe.sumelectthermalfe: -569.927509 hartree
dipole: 1.4938 -0.1663 -1.5679
dipole: 2.1720
quadrupole: -58.1465 -61.9015 -75.6108
quadrupole: 3.2709 -3.7241 0.5501
quadrupole: 7.0731 3.3181 -10.3912 3.2709 -3.7241 0.5501
hfenergy: -570.0604235 hartree
pointgroup: C01 [X(C8H10N2O2)]
dipole: 0.5599217 -0.3622257 0.5343128 debye
dipolederiv: -1.552085 0.3076433 0.2448484 0.5989421 -0.5972387 -0.0409061 0.2630408 0.0470448 -0.4444174 -0.6503611 0.0562839 0.0540664 0.0044938 -0.7469753 0.2871752 0.1663921 0.3123118 -0.5994163 -0.5467862 -0.1349679 -0.2320704 -0.2625007 -0.0120533 0.1589354 -0.5833021 -0.0096798 -0.7014091 -0.6308592 -0.2037336 0.1670272 -0.6248174 -0.2593683 -0.1275922 0.4490458 -0.03387 -0.495435 1.0350354 0.2157209 0.500152 0.432749 0.0416535 0.0659164 0.6927605 0.0852701 0.442555 -0.4200855 -0.1517673 -0.1379306 0.0814492 0.0128328 0.1918497 -0.0223372 0.0612142 -0.1626685 -0.1954949 -0.0349347 -0.0055327 -0.3518815 -0.1163899 -0.065196 -0.2115394 0.0538252 -0.2486392 0.1258042 -0.0021946 0.120375 -0.0703093 0.1044633 0.0987611 0.0750977 0.1418502 -0.0101548 0.1670113 -0.111949 0.0606258 -0.0121855 0.0934185 0.1231883 0.1441113 0.0915742 -0.0201234 -0.1423327 0.0505214 0.0862773 0.0420606 -0.2294143 0.0147187 0.0623605 0.012999 -0.1688676 1.9430611 -0.2694267 -0.4588631 -0.2949251 1.0632819 -0.3421754 -0.7100155 -0.4844949 0.9369725 0.6783818 -0.0387891 -0.1463231 0.0555056 0.2417249 0.0206421 -0.3118172 0.0612119 0.3567745 0.0949224 -0.0235342 -0.0519289 -0.0011467 -0.0409988 -0.1282635 -0.0370305 -0.1312192 0.0651117 -0.0036458 0.1129015 -0.018794 0.1271847 0.0550775 -0.034793 -0.0081764 -0.0238683 0.1247317 0.0280965 0.0315648 -0.0369621 0.0758737 0.1019974 -0.0706151 0.0245104 0.0205716 0.350016 -0.0536082 0.1176177 -0.0146763 0.1270348 0.0164959 -0.0266861 -0.0168315 -0.0290363 0.1306081 0.0905884 0.0103479 -0.0184979 -0.0074891 -0.0563031 -0.1248123 -0.0344738 -0.1231853 0.0658493 -0.0592108 -0.0250495 -0.1173893 -0.024992 0.0950893 -0.0612029 -0.1246067 -0.0599263 0.0830931 0.1396516 0.050718 0.0455821 0.1664473 0.2056014 0.0621879 0.1064904 0.0623509 0.2606211 -0.037368 0.0954612 0.0089554 0.1375902 -0.0113876 0.0231084 -0.0067706 0.0431879 0.099527 -0.0178438 -0.043662 0.0224495 -0.1561885 -0.0642781 -0.0314921 0.0468623 -0.0660528 0.0497448 0.0071283 -0.0087721 -0.0713907 -0.0428952 0.102771 0.0072514 0.0362293 -0.0320788 -0.1144735 unknown
polarizability: 143.6964607|-10.2764872|93.0193064|12.9997043|14.1536202|78.3611991 unknown
InChI: InChI=1S/C8H10N2O2/c1-12-8(11)10-9-7-5-3-2-4-6-7/h2-6,9-10H,1H3
charge 0 multiplicity 1
22 atoms
O  3.260034 -0.740006 0.303108
O  2.10841 1.129783 -0.568941
N  0.053474 0.49786 1.347241
N  1.254863 -0.187742 1.196899
C  -1.077627 0.168645 0.552951
C  -2.198077 1.042833 0.571294
C  -1.134606 -1.027831 -0.207436
C  -3.355585 0.720508 -0.165176
C  -2.301775 -1.337396 -0.938694
C  -3.419529 -0.472109 -0.925023
C  2.187243 0.16466 0.224155
C  4.366837 -0.467189 -0.638342
H  -2.159016 1.969681 1.157522
H  -0.270979 -1.699864 -0.232776
H  0.144918 1.467822 1.658631
H  -4.210981 1.405473 -0.146301
H  -2.333622 -2.262109 -1.526452
H  -4.320422 -0.718431 -1.496332
H  1.460519 -0.962598 1.829853
H  5.089096 -1.276932 -0.462988
H  4.818283 0.517038 -0.42686
H  4.000042 -0.481594 -1.678334
