program: Gaussian 09
title: 000256032
version: EM64L-G09RevD.01
frameworkgroup: C1[X(C19H21N)]
method: RPBEPBE
basis: SDD
operation: Freq
keyword: #pfreq=noraman
keyword: PBEPBE/SDD
title: #p freq=noraman PBEPBE/SDD
converged: YES YES NO NO
title: Mulliken charges:
elementType: N C C C C C C C C C C C C C C C C C C C H H H H H H H H H H H H H H H H H H H H H
charge: -0.020572 0.220758 -0.477328 -0.652537 -0.363792 0.398741 -0.352626 0.493556 -0.257612 -0.396675 -0.382137 -0.699712 -0.401698 -0.384822 -0.241476 -0.254214 -0.244503 -0.245970 -0.236039 -0.241013 0.207360 0.226989 0.238652 0.238435 0.220030 0.215271 0.196195 0.192560 0.254056 0.246582 0.215962 0.212196 0.215469 0.234781 0.251402 0.228868 0.228704 0.230909 0.226635 0.228425 0.230188
chargesum: 0.00000
title: Mulliken charges with hydrogens summed into heavy atoms:
elementType: N C C C C C C C C C C C C C C C C C C C
charge: -0.020572 0.220758 -0.042979 -0.175450 0.071509 0.398741 0.036129 0.493556 -0.257612 -0.142619 -0.135554 -0.056085 -0.166917 -0.133421 -0.012608 -0.025510 -0.013594 -0.019335 -0.007614 -0.010825
polarizability: 1.91494284e+02 -6.87401461e+00 2.18998362e+02 -3.70727922e+01 -1.08735814e+00 1.81137184e+02
1716.lowfreq: -8.2567 0.0003 0.0007 0.0008 8.9199 9.7399 24.7941 27.9046 45.2004
frequency: 24.7591 27.6987 45.0676 51.8864 64.9232 70.3089 94.9458 110.9079 123.4800 150.7664 155.3727 209.9291 233.7878 234.6976 258.6930 270.5742 348.8547 358.8831 403.7122 403.8595 407.0545 411.3028 446.6269 460.4317 509.9521 593.2491 604.0814 614.7736 617.4744 618.7497 697.5196 704.1330 707.9818 733.8889 755.1342 772.7510 787.8485 816.2198 854.6153 856.5009 858.0310 889.1068 910.1547 917.2298 930.4323 962.2110 978.5020 980.7672 984.2130 990.6811 992.4391 996.9687 998.1713 1022.6490 1027.9031 1030.8672 1057.8872 1080.6054 1084.7853 1095.4942 1116.0801 1141.0745 1172.0314 1174.3876 1177.4408 1190.4066 1200.6653 1216.5556 1219.0540 1248.0293 1272.2755 1286.3331 1295.9814 1317.3974 1326.8248 1331.9256 1334.6691 1358.7105 1377.8223 1382.5241 1390.7584 1435.6784 1440.7876 1465.0803 1468.0055 1472.0840 1477.8992 1481.2403 1483.2067 1486.8868 1491.5985 1590.2965 1590.9264 1611.5230 1612.4770 2179.4562 2960.4345 2974.0022 2976.8626 2986.3626 2997.0354 3003.6542 3030.5916 3054.0950 3059.4928 3071.6415 3073.2504 3117.7490 3123.6924 3124.3691 3129.9880 3136.2592 3142.2110 3146.9583 3153.7673 3163.7812 3166.2380
redmass: 4.4559 3.8454 3.9538 4.0897 1.7568 3.1032 5.0182 4.8310 4.4526 4.8215 3.5225 3.7372 1.1386 4.0041 3.9575 2.6925 2.6583 2.8392 3.0492 4.0473 2.9452 4.3690 4.6051 3.8567 3.4443 5.7526 4.2255 4.7046 6.2403 6.3195 4.9774 1.8305 1.7217 1.0845 1.7854 1.6987 1.4984 3.6079 1.5907 1.4139 1.3333 2.0223 1.4810 1.4936 1.4122 2.7033 1.4408 1.4182 2.2023 6.1425 4.8066 1.3144 1.3576 2.9066 2.1955 2.3331 2.6538 2.3059 1.6183 1.7086 2.4310 2.0915 1.1365 1.1344 1.4829 1.1301 1.1192 1.6750 2.0206 1.5576 1.3328 1.2208 1.0964 1.3752 1.3619 1.2963 1.3596 1.5535 7.2971 7.1116 1.2144 2.2372 2.1539 1.1245 1.0662 1.0967 1.0422 1.2888 2.0261 1.5392 1.1542 5.9557 5.9541 5.9656 6.0869 12.6627 1.0590 1.0383 1.0576 1.0618 1.0598 1.0990 1.0995 1.1028 1.1033 1.1007 1.0995 1.0865 1.0851 1.0865 1.0878 1.0917 1.0923 1.0962 1.0953 1.1015 1.1010
irintensity: 0.0689 0.0588 0.2983 0.1708 0.0161 0.0413 0.8659 1.7625 2.5876 1.2501 2.3497 0.7515 0.0307 0.2759 0.4004 0.1312 0.3037 0.1803 0.0765 0.2679 0.0424 0.5833 0.1624 6.4837 3.2711 3.2797 22.8007 12.6524 0.1717 0.2196 1.8547 43.4578 74.6592 11.7176 6.8682 47.8023 11.6020 1.7548 0.6834 0.5113 0.2383 4.4080 1.4323 0.2997 4.5385 4.2473 0.3596 0.2400 3.1906 0.2458 1.7841 0.1747 0.4416 3.1263 6.1727 6.1079 1.8641 0.4810 16.6126 3.7050 6.5251 0.1321 0.0529 0.0991 0.4760 1.1378 0.4271 0.2572 0.8112 6.2562 4.3813 3.3525 0.6024 2.8613 3.0102 0.7615 3.0926 2.2973 0.4169 0.2224 11.9132 8.4859 9.1444 11.9539 0.4651 2.7454 12.4554 8.2408 14.7809 20.2635 11.9420 0.5331 1.3254 5.1439 2.9514 14.1599 22.1393 28.6648 16.2187 47.4106 20.5718 6.6321 3.5397 23.5481 20.6512 81.7412 48.3202 7.0747 1.1587 1.0751 0.8649 15.8477 15.2488 38.3383 37.0472 20.1290 14.4416
temp: 298.150 k
press: 1.00000 atm
elementType: 7 6 6 6 6 6 6 6 6 6 6 6 6 6 6 6 6 6 6 6 1 1 1 1 1 1 1 1 1 1 1 1 1 1 1 1 1 1 1 1 1
symmnumber: 1
zpe: 902062.2 jmol-1
zpe.correction: 0.343577 hartree
zpe.thermalcorrener: 0.362858 hartree
zpe.thermalcorrenthalpy: 0.363802 hartree
zpe.thermalcorrgfe: 0.294017 hartree
zpe.sumelectzpe: -789.915717 hartree
zpe.sumelectthermal: -789.896437 hartree
zpe.sumelectthermalent: -789.895493 hartree
zpe.sumelectthermalfe: -789.965277 hartree
dipole: 2.5753 -0.6385 -3.2092
dipole: 4.1639
quadrupole: -125.7743 -107.2067 -127.5211
quadrupole: 2.2891 4.1400 -2.4137
quadrupole: -5.6069 12.9607 -7.3537 2.2891 4.1400 -2.4137
hfenergy: -790.2592945 hartree
pointgroup: C01 [X(C19H21N1)]
dipole: -1.0514127 -0.1972226 1.2407176 debye
polarizability: 193.7644867|6.7929413|218.6783681|-36.8589821|1.4732934|179.1869756 unknown
InChI: InChI=1S/C19H21N/c1-2-3-14-19(16-20,18-12-8-5-9-13-18)15-17-10-6-4-7-11-17/h4-13H,2-3,14-15H2,1H3
charge 0 multiplicity 1
41 atoms
N  2.4639 0.258942 -2.968711
C  0.711508 -0.099182 -0.975851
C  1.16436 -1.370943 -0.181699
C  -0.680896 -0.375783 -1.716339
C  2.549499 -1.264024 0.490964
C  0.603936 1.172295 -0.100341
C  2.932956 -2.56047 1.241182
C  -1.84443 -0.741829 -0.809678
C  1.695526 0.120309 -2.066244
C  0.900875 2.449458 -0.641834
C  0.136874 1.097895 1.236583
C  4.312707 -2.464716 1.926998
C  -2.139854 -2.100105 -0.518252
C  -2.686531 0.262641 -0.26435
C  0.738799 3.620981 0.130298
C  -0.023016 2.267795 2.011773
C  0.276256 3.535506 1.463305
C  -3.234844 -2.445801 0.305293
C  -3.783476 -0.078083 0.558319
C  -4.060225 -1.434198 0.849153
H  1.167232 -2.224982 -0.888319
H  0.393488 -1.602112 0.576469
H  -0.498546 -1.190208 -2.442849
H  -0.923138 0.533226 -2.296623
H  3.320375 -1.04467 -0.274668
H  2.559059 -0.413221 1.199869
H  2.93195 -3.410243 0.528026
H  2.156507 -2.789414 2.00017
H  1.274618 2.530203 -1.669435
H  -0.112935 0.12952 1.681145
H  4.569212 -3.402203 2.453581
H  4.330181 -1.643907 2.668473
H  5.109302 -2.263283 1.18649
H  -1.516716 -2.892221 -0.951812
H  -2.480829 1.315881 -0.488046
H  0.979922 4.596232 -0.307046
H  -0.384345 2.186742 3.043043
H  0.154401 4.442283 2.066129
H  -3.449095 -3.500088 0.514071
H  -4.423395 0.712259 0.966559
H  -4.913678 -1.699984 1.483009
