program: Gaussian 09
title: 000255987
version: EM64L-G09RevD.01
frameworkgroup: C1[X(C13H13NO)]
method: RPBEPBE
basis: SDD
operation: Freq
keyword: #p
keyword: freq=noraman
keyword: PBEPBE/SDD
title: #p freq=noraman PBEPBE/SDD
converged: YES YES NO NO
title: Mulliken charges:
elementType: O N C C C C C C C C C C C C C H H H H H H H H H H H H H
charge: -0.228024 -0.695840 0.277925 0.542204 0.331000 -0.522668 0.356510 -0.626439 0.308235 -0.080750 -0.496497 -0.449564 -0.233248 -0.784992 -0.783085 0.170496 0.207766 0.241805 0.219232 0.229239 0.192512 0.251106 0.247244 0.246370 0.249471 0.200563 0.316746 0.312684
chargesum: 0.00000
title: Mulliken charges with hydrogens summed into heavy atoms:
elementType: O N C C C C C C C C C C C C C
charge: -0.228024 -0.066411 0.277925 0.542204 0.331000 -0.352173 0.356510 -0.418672 0.308235 -0.080750 -0.254691 -0.230332 -0.004009 -0.094130 -0.086681
polarizability: 2.65010012e+02 8.01704221e+00 1.76097813e+02 -1.28510295e+00 -1.89500236e+00 7.00129244e+01
1716.lowfreq: -11.8055 -6.3636 -0.0010 -0.0009 -0.0007 5.2574 40.9874 55.2093 122.2633
frequency: 40.9822 55.1876 122.2599 154.5926 157.3376 186.0236 227.0830 266.6564 296.5487 304.2588 319.7351 329.9794 362.8802 378.5606 386.0198 427.7818 435.6761 463.7313 485.7938 546.5892 551.6134 595.4322 612.2644 647.8213 718.1465 744.0026 769.4773 777.1994 806.4276 847.1748 869.4625 907.1294 939.7639 947.2666 970.1613 973.7272 1018.6231 1042.7046 1048.9546 1052.6588 1083.9292 1117.8160 1168.6685 1188.5870 1230.3662 1256.9592 1304.7458 1330.2288 1371.8831 1394.7099 1397.9845 1418.4953 1433.7321 1439.8681 1440.7687 1446.7630 1454.3765 1473.0422 1483.3600 1494.7352 1574.8922 1594.8262 1613.6626 1629.0561 1648.5058 2983.3772 2985.2250 3064.8538 3065.5660 3079.2431 3085.7224 3095.0972 3096.2574 3122.5508 3135.9828 3160.1670 3568.4687 3704.0561
redmass: 4.7203 4.0766 3.1946 1.1541 1.1095 2.3266 3.9685 3.3203 2.7513 3.6818 2.0500 3.0158 3.8309 2.7213 3.1266 1.2672 3.5835 3.5546 4.0904 3.5650 4.2159 4.4238 3.8348 5.2401 6.7559 1.5358 4.2129 4.4623 2.2323 3.9762 1.4137 1.5773 1.5117 3.6734 1.4064 2.3592 1.5394 1.7048 1.5508 1.5857 2.6847 1.6361 2.2801 1.4691 2.3641 2.6827 2.2589 2.5288 3.1530 1.2518 1.2274 2.2363 1.9113 1.0614 1.0490 1.6592 1.8708 1.4714 1.8742 3.4814 6.1692 5.4392 5.3063 5.1764 1.2531 1.0358 1.0358 1.0957 1.0956 1.0890 1.0959 1.0915 1.0988 1.0870 1.0902 1.0996 1.0457 1.1027
irintensity: 1.1451 3.9920 2.8771 1.2683 1.8534 5.9388 0.6328 0.0602 2.2327 7.2587 24.7252 31.8240 9.7314 38.0389 42.5968 143.9586 1.2069 3.3512 9.3076 0.5460 0.8848 2.5799 0.0959 1.4462 1.4409 42.7912 2.4203 3.2223 35.9673 1.3348 4.8809 10.3915 12.1932 13.7386 4.2749 6.5286 24.3395 1.5596 5.6120 12.2364 11.0682 3.6319 8.3148 27.0938 15.7577 0.7228 6.8334 55.0610 20.8209 51.7564 31.1194 4.4098 78.8583 25.7106 4.0869 53.5135 25.2173 2.5683 61.8727 174.5799 30.8144 51.1465 35.9476 17.6015 223.2281 24.5085 18.7685 21.8876 2.0857 13.2758 2.8690 59.0731 9.4136 10.5538 16.8446 31.4043 59.2933 21.0446
temp: 298.150 k
press: 1.00000 atm
elementType: 8 7 6 6 6 6 6 6 6 6 6 6 6 6 6 1 1 1 1 1 1 1 1 1 1 1 1 1
symmnumber: 1
zpe: 591710.2 jmol-1
zpe.correction: 0.225371 hartree
zpe.thermalcorrener: 0.239063 hartree
zpe.thermalcorrenthalpy: 0.240007 hartree
zpe.thermalcorrgfe: 0.185460 hartree
zpe.sumelectzpe: -632.092104 hartree
zpe.sumelectthermal: -632.078411 hartree
zpe.sumelectthermalent: -632.077467 hartree
zpe.sumelectthermalfe: -632.132014 hartree
dipole: -5.4549 1.0530 -0.0804
dipole: 5.5562
quadrupole: -89.9075 -71.6127 -93.2053
quadrupole: -8.3929 2.8666 -1.4576
quadrupole: -4.9990 13.2958 -8.2968 -8.3929 2.8666 -1.4576
hfenergy: -632.3174745 hartree
pointgroup: C01 [X(C13H13N1O1)]
dipole: 2.1312647 0.4712527 0.1189094 debye
polarizability: 265.1414479|-5.7052051|175.7479887|6.8494625|1.1994644|70.2313127 unknown
InChI: InChI=1S/C13H13NO/c1-8-6-10-4-3-5-12(14)11(10)7-9(2)13(8)15/h3-7H,14H2,1-2H3
charge 0 multiplicity 1
28 atoms
O  -3.676528 0.38596 -0.054116
N  2.570452 2.258402 0.189957
C  0.910301 0.422672 -0.090722
C  0.69126 -1.004227 -0.128037
C  -1.520216 1.371653 -0.262588
C  -0.134818 1.416892 -0.229149
C  -1.917066 -1.215473 -0.156912
C  -0.607174 -1.658803 -0.179313
C  2.276475 0.900661 0.052129
C  -2.406564 0.187689 -0.133165
C  1.810942 -1.891325 -0.112954
C  3.357947 -0.016807 0.054248
C  3.123956 -1.402731 -0.04225
C  -2.28446 2.674397 -0.427317
C  -3.033981 -2.243504 -0.161066
H  0.244038 2.438984 -0.369714
H  -0.512016 -2.754636 -0.214048
H  1.630151 -2.970505 -0.153647
H  4.382486 0.362453 0.149728
H  3.970814 -2.097083 -0.038718
H  -1.604408 3.534987 -0.54944
H  -2.941792 2.848635 0.443852
H  -2.96301 2.620404 -1.298167
H  -3.709147 -2.08059 -1.020915
H  -3.669069 -2.124096 0.735442
H  -2.639485 -3.273046 -0.195348
H  1.859785 2.949086 0.405961
H  3.541527 2.552151 0.249568
