program: Gaussian 09
title: 000255976
version: EM64L-G09RevD.01
frameworkgroup: C1[X(C10H7NO4)]
method: RPBEPBE
basis: SDD
operation: Freq
keyword: #p
keyword: freq=noraman
keyword: PBEPBE/SDD
title: #p freq=noraman PBEPBE/SDD
converged: NO YES NO NO
title: Mulliken charges:
elementType: O O O O N C C C C C C C C C C H H H H H H H
charge: -0.251636 -0.155584 -0.383498 -0.267057 -0.703373 0.442447 0.138599 -0.339541 -0.585688 0.057175 0.526829 -0.323468 -0.399332 0.088388 0.121452 0.290040 0.238535 0.265182 0.229981 0.313241 0.313953 0.383357
chargesum: 0.00000
title: Mulliken charges with hydrogens summed into heavy atoms:
elementType: O O O O N C C C C C C C C C C
charge: -0.251636 -0.155584 -0.000141 -0.267057 -0.076179 0.442447 0.138599 -0.049502 -0.347154 0.057175 0.526829 -0.058286 -0.169351 0.088388 0.121452
polarizability: 2.49504632e+02 4.86945839e+00 1.36587671e+02 -5.85350461e-02 1.17536197e-01 5.01611336e+01
1716.lowfreq: -9.3327 0.0007 0.0009 0.0009 2.3057 6.8932 28.5236 58.7724 85.4315
frequency: 28.4981 58.7704 85.4282 152.0805 168.5394 245.3016 260.6564 308.3630 347.2567 352.7413 361.3982 385.8450 387.1142 397.2283 424.6622 451.4115 532.8319 568.5724 578.1559 581.4662 612.1611 671.8410 679.8608 700.5024 737.9566 763.4369 772.7913 826.7652 830.5321 857.3256 859.6513 944.7370 952.5650 985.2390 1041.5319 1042.5517 1126.7123 1135.4344 1210.5668 1219.4428 1268.3217 1306.0007 1351.2725 1368.0646 1419.8000 1448.2495 1489.7115 1567.9199 1586.7860 1610.5084 1639.5584 1651.0678 1701.2392 3130.4451 3133.7619 3137.7161 3176.9531 3507.7254 3569.6843 3708.4338
redmass: 9.6075 6.9202 5.9678 6.8005 6.3852 5.2648 5.9401 8.4579 7.4863 1.0999 4.0545 3.5706 4.9474 1.4145 4.5857 2.8399 7.7497 6.9942 6.5410 2.0638 1.7480 5.5075 4.0090 7.3985 3.2313 8.0782 6.0608 1.5220 9.1990 6.9101 1.7000 2.8220 1.3618 1.4663 3.6425 1.4751 2.0257 1.4335 1.5993 2.9143 1.6439 2.0543 3.0494 3.1285 8.0666 5.3119 3.6565 6.9412 7.1959 7.2816 2.1853 1.8281 12.7077 1.0913 1.0906 1.0920 1.0954 1.0638 1.0452 1.1041
irintensity: 4.2520 0.0026 0.1979 3.6518 0.2282 1.7768 0.5961 1.0476 4.8907 60.1362 13.9310 43.0626 21.9156 197.7043 1.8468 1.7184 9.1813 52.4260 59.7236 74.3608 54.5636 23.3353 34.3825 5.1555 2.2877 29.0371 1.0059 51.4274 73.3193 3.8752 26.7568 5.4457 0.0238 22.0079 213.7167 1.4606 224.3136 54.8215 29.1487 2.0024 2.8177 186.5098 10.4615 31.8706 13.6918 9.9271 84.7708 430.1455 120.2965 149.6556 27.4010 224.9504 531.5352 7.9600 19.6669 0.9905 4.0018 48.1493 102.8787 24.5103
temp: 298.150 k
press: 1.00000 atm
elementType: 8 8 8 8 7 6 6 6 6 6 6 6 6 6 6 1 1 1 1 1 1 1
symmnumber: 1
zpe: 403268.0 jmol-1
zpe.correction: 0.153597 hartree
zpe.thermalcorrener: 0.166212 hartree
zpe.thermalcorrenthalpy: 0.167157 hartree
zpe.thermalcorrgfe: 0.113949 hartree
zpe.sumelectzpe: -739.873998 hartree
zpe.sumelectthermal: -739.861382 hartree
zpe.sumelectthermalent: -739.860438 hartree
zpe.sumelectthermalfe: -739.913645 hartree
dipole: -7.0326 -3.2723 0.0434
dipole: 7.7568
quadrupole: -58.3833 -91.0045 -88.1704
quadrupole: -1.4546 0.0127 -0.0746
quadrupole: 20.8028 -11.8184 -8.9844 -1.4546 0.0127 -0.0746
hfenergy: -740.0275948 hartree
pointgroup: C01 [X(C10H7N1O4)]
dipole: 2.745845 1.3317538 0.0055354 debye
dipolederiv: -1.1169732 -0.563911 -0.0013556 0.0980678 -0.386897 -0.0059761 0.0110205 0.0018946 -0.2004216 -0.988059 -0.4044595 -0.003482 -0.7269056 -0.8126978 -0.0046138 -0.0069476 -0.006389 -0.3081339 -1.284963 -0.3599429 0.0155062 -0.4662553 -0.3546398 0.0125574 0.01764 0.0113824 -0.3924324 -0.8131488 0.2114942 0.0132086 0.3782074 -1.0374246 -0.0135339 0.0196754 -0.014966 -0.3389555 -1.3537455 -0.5954689 -0.0023474 -0.9064982 -0.4385782 0.0210797 -0.0024887 0.0188904 -0.7534456 -0.5561065 0.3506901 0.0155249 0.5409919 -0.0785222 -0.0103057 0.0206283 -0.0074489 0.0287559 0.381246 0.460783 0.0067243 -0.0864828 0.196954 0.0045423 -0.0053849 -0.0026407 0.0881547 1.1724645 -0.1628884 -0.0206756 0.0865778 0.1317776 0.0021981 -0.0177022 0.0063629 -0.0280614 -0.1557954 -0.4806089 -0.0109528 0.2312778 0.087412 0.0031062 0.0042129 0.0126021 -0.2334127 -1.2598452 0.2102319 0.0236228 -0.4345886 -0.3962168 -0.0023546 0.0100703 -0.0118302 -0.0438061 1.2616189 0.8379598 0.0008657 1.2597068 0.1937792 -0.0179158 0.0092259 -0.0114816 0.1543726 0.0171261 -0.2777039 -0.0081364 -0.0167034 0.1068668 0.0052407 -0.0018287 0.0081806 -0.1319963 -0.1390731 0.0623605 0.0006362 -0.6054236 0.0456669 0.0134123 -0.0144941 0.0044133 -0.1883128 1.5882723 0.6772703 0.003132 0.7334271 1.0311475 0.0115327 0.004116 0.0097721 0.2863562 2.2949285 -0.1887001 -0.0487889 -0.4034475 1.292715 0.0157571 -0.0581793 0.0158939 0.2408754 0.1441045 -0.0191246 -0.0004846 -0.0027479 0.0137668 -0.0029496 -0.0006013 -0.0024479 0.1356708 0.0611681 0.0147289 0.001834 -0.0424815 -0.085119 -0.0047165 0.0006352 -0.0053168 0.1713925 0.0991935 -0.0068822 0.0008287 0.02518 -0.0281085 -0.0045635 0.0013854 -0.004252 0.1703652 -0.1133199 0.0691896 0.005238 0.0361156 0.0641551 -0.0024629 0.004544 -0.0029806 0.1607192 0.2537069 0.0348349 0.0020355 0.0243338 0.128167 -0.0058266 -0.0006464 -0.006521 0.393381 0.163173 0.0503105 0.0042862 0.0938942 0.170127 -0.0068849 0.0026038 -0.0079376 0.3921747 0.3440275 0.0798368 0.0027802 0.1837543 0.1556688 -0.0073227 0.0025157 -0.00518 0.3967602 unknown
polarizability: 249.275543|6.7367416|136.7375654|-2.8207503|1.7494172|50.2403281 unknown
InChI: InChI=1S/C10H7NO4/c11-6-1-2-8-5(3-6)4-7(9(12)13)10(14)15-8/h1-4,12H,11H2
charge 0 multiplicity 1
22 atoms
O  -0.239895 -1.779532 0.005116
O  -2.513666 -2.098387 0.024822
O  -4.112413 0.156687 0.13053
O  -3.069082 2.222708 0.130869
N  4.411714 1.395704 0.008684
C  0.783136 0.454802 0.039847
C  0.891562 -0.967325 0.008156
C  -0.540581 1.01085 0.071642
C  1.964832 1.248446 0.040512
C  -1.688456 0.225902 0.071389
C  3.240592 0.639467 0.01053
C  2.158246 -1.589036 -0.021763
C  3.314287 -0.794831 -0.020641
C  -1.613353 -1.248309 0.031625
C  -2.98373 0.965649 0.111419
H  -0.678034 2.098719 0.098664
H  1.87172 2.340831 0.063912
H  2.217885 -2.680628 -0.045544
H  4.29799 -1.278816 -0.044792
H  5.322513 0.947108 -0.009856
H  4.379039 2.410396 0.035551
H  -4.917308 0.743495 0.158126
